Piperidine, 5-ethyl-2-methyl-
- Formula: C8H17N
- Molecular weight: 127.2273
- IUPAC Standard InChIKey: XOFNHZHCGBPVGJ-UHFFFAOYSA-N
- CAS Registry Number: 104-89-2
- Chemical structure:
View 3d structure (requires JavaScript / HTML 5) - Other names: Copellidine; 2-Methyl-5-ethylpiperidine; 2-Pipecoline, 5-ethyl-; 5-Ethyl-2-methylpiperidine; Copellidin; 3-Ethyl-6-methylpiperidine; 5-Ethyl-2-pipecoline

Phase change data

Data compiled by: Thermodynamics Research Center, NIST Boulder Laboratories, Chris Muzny director
Quantity | Value | Units | Method | Reference | Comment |
---|---|---|---|---|---|
Tfus | 258.3 | K | N/A | Anonymous, 1954 | Uncertainty assigned by TRC = 0.6 K |

References

Anonymous, 1954
Anonymous, R.,
, Am. Pet. Inst. Res. Proj. 45, Tech. Rep. 13, Ohio State Univ., 1954. [all data]