2-Butenoyl chloride
- Formula: C4H5ClO
- Molecular weight: 104.535
- IUPAC Standard InChIKey: RJUIDDKTATZJFE-UHFFFAOYSA-N
- CAS Registry Number: 10487-71-5
- Chemical structure:
View 3d structure (requires JavaScript / HTML 5) - Stereoisomers:
- Other names: Crotonyl chloride; Crotonic acid chloride; (2E)-2-butenoyl chloride; crotonoyl chloride

Phase change data

Data compiled by: Thermodynamics Research Center, NIST Boulder Laboratories, Chris Muzny director
Quantity | Value | Units | Method | Reference | Comment |
---|---|---|---|---|---|
Tboil | 394. | K | N/A | Miller, Dessert, et al., 1970 | Uncertainty assigned by TRC = 4. K |
Tboil | 394. | K | N/A | Miller, Dessert, et al., 1948 | Uncertainty assigned by TRC = 4. K |

Normal alkane RI, non-polar column, temperature ramp

Column type | Active phase | I | Reference | Comment |
---|---|---|---|---|
Capillary | OV-101 | 796. | Zenkevich, 2005 | 25. m/0.20 mm/0.10 μm, N2/He, 6. K/min; Tstart: 50. C; Tend: 250. C |

References

Miller, Dessert, et al., 1970
Miller, W.H.; Dessert, A.M.; Anderson, G.W.,
The Synthesis of Some 6-Substituted-2-thiouracils,
J. Am. Chem. Soc., 1970, 70, 500-3. [all data]
Miller, Dessert, et al., 1948
Miller, W.H.; Dessert, A.M.; Anderson, G.W.,
The Synthesis of Some 6-Substituted-2-thiouracils,
J. Am. Chem. Soc., 1948, 70, 500-3. [all data]
Zenkevich, 2005
Zenkevich, I.G.,
Experimentally measured retention indices., 2005. [all data]