2-Chlorobenzoic acid, 2-phenylethyl ester
- Formula: C15H13ClO2
- Molecular weight: 260.716
- IUPAC Standard InChIKey: FANZVPUMGJHASY-UHFFFAOYSA-N
- CAS Registry Number: 104856-44-2
- Chemical structure:
View 3d structure (requires JavaScript / HTML 5) - Other names: Benzoic acid, 2-chloro, 2-phenylethyl ester; 2-Phenylethyl 2-chlorobenzoate

Kovats' RI, non-polar column, isothermal

Column type | Active phase | Temperature (C) | I | Reference | Comment |
---|---|---|---|---|---|
Capillary | SE-30 | 140. | 1953. | Korhonen, 1986 | N2; Column length: 25. m; Column diameter: 0.33 mm |
Capillary | SE-30 | 160. | 1969. | Korhonen, 1986 | N2; Column length: 25. m; Column diameter: 0.33 mm |
Capillary | SE-30 | 180. | 1989. | Korhonen, 1986 | N2; Column length: 25. m; Column diameter: 0.33 mm |
Capillary | SE-30 | 200. | 2006. | Korhonen, 1986 | N2; Column length: 25. m; Column diameter: 0.33 mm |
Capillary | SE-30 | 220. | 2020. | Korhonen, 1986 | N2; Column length: 25. m; Column diameter: 0.33 mm |
Capillary | SE-30 | 240. | 2037. | Korhonen, 1986 | N2; Column length: 25. m; Column diameter: 0.33 mm |
Capillary | SE-30 | 180. | 1989. | Korhonen, 1986 | N2; Column length: 25. m; Column diameter: 0.33 mm |

Kovats' RI, polar column, isothermal

Column type | Active phase | Temperature (C) | I | Reference | Comment |
---|---|---|---|---|---|
Capillary | OV-351 | 180. | 2927. | Korhonen, 1986 | N2; Column length: 25. m; Column diameter: 0.32 mm |
Capillary | OV-351 | 200. | 2959. | Korhonen, 1986 | N2; Column length: 25. m; Column diameter: 0.32 mm |
Capillary | OV-351 | 220. | 2994. | Korhonen, 1986 | N2; Column length: 25. m; Column diameter: 0.32 mm |
Capillary | OV-351 | 180. | 2927. | Korhonen, 1986 | N2; Column length: 25. m; Column diameter: 0.32 mm |

Van Den Dool and Kratz RI, non-polar column, temperature ramp

Column type | Active phase | I | Reference | Comment |
---|---|---|---|---|
Capillary | SE-30 | 1987. | Korhonen, 1986 | N2, 6. K/min; Column length: 25. m; Column diameter: 0.33 mm; Tstart: 100. C |
Capillary | SE-30 | 2001. | Korhonen, 1986 | N2, 10. K/min; Column length: 25. m; Column diameter: 0.33 mm; Tstart: 50. C |

Van Den Dool and Kratz RI, polar column, temperature ramp

Column type | Active phase | I | Reference | Comment |
---|---|---|---|---|
Capillary | OV-351 | 2979. | Korhonen, 1986 | N2, 10. K/min; Column length: 25. m; Column diameter: 0.32 mm; Tstart: 50. C; Tend: 220. C |
Capillary | OV-351 | 2968. | Korhonen, 1986 | N2, 6. K/min; Column length: 25. m; Column diameter: 0.32 mm; Tstart: 50. C; Tend: 220. C |

References

Korhonen, 1986
Korhonen, I.O.O.,
Gas-Liquid Chromatographic Analyses. XLVIII. Benzyl, (±)-1-Phenylethyl and 2-Phenylethyl Alcohols and the Corresponding Esters of Benzoic Acid and Its 2-, 3- and 4-Chloro, Pentafluoro, 4-Nitro and 3,5-Dinitro Derivatives on SE-30 and OV-351 Capillary Columns,
J. Chromatogr., 1986, 363, 277-292. [all data]