Pentanoic acid, 3-phenyl-2-propenyl ester
- Formula: C14H18O2
- Molecular weight: 218.2915
- IUPAC Standard InChIKey: FLSKWIBFXUNBAW-JXMROGBWSA-N
- CAS Registry Number: 10482-65-2
- Chemical structure:
View 3d structure (requires JavaScript / HTML 5) - Other names: Cinnamyl N-valerate; 3-Phenyl-2-propenyl pentanoate; Cinnamyl valerate; Valeric acid, cinnamyl ester

Normal alkane RI, non-polar column, temperature ramp

Column type | Active phase | I | Reference | Comment |
---|---|---|---|---|
Capillary | HP-5 | 1688. | Radulovic, Dordevic, et al., 2010 | 30. m/0.25 mm/0.25 μm, Hydrogen, 5. K/min; Tstart: 70. C; Tend: 290. C |

Normal alkane RI, non-polar column, custom temperature program

Column type | Active phase | I | Reference | Comment |
---|---|---|---|---|
Capillary | SE-30 | 1705. | Vinogradov, 2004 | Program: not specified |

Normal alkane RI, polar column, custom temperature program

Column type | Active phase | I | Reference | Comment |
---|---|---|---|---|
Capillary | Carbowax 20M | 2347. | Vinogradov, 2004 | Program: not specified |

References

Radulovic, Dordevic, et al., 2010
Radulovic, N.S.; Dordevic, N.D.; Palic, R.M.,
Volatiles of Pleurospermum austriacum (L.) Hoffm. (Apiaceae),
J. Serbian Chem. Soc., 2010, 75, 12, 1-11, https://doi.org/10.2298/JSC100323127R
. [all data]
Vinogradov, 2004
Vinogradov, B.A.,
Production, composition, properties and application of essential oils, 2004, retrieved from http://viness.narod.ru. [all data]