L-α-Terpineol
- Formula: C10H18O
- Molecular weight: 154.2493
- IUPAC Standard InChIKey: WUOACPNHFRMFPN-VIFPVBQESA-N
- CAS Registry Number: 10482-56-1
- Chemical structure:
View 3d structure (requires JavaScript / HTML 5) - Stereoisomers:
- Other names: 3-Cyclohexene-1-methanol, α,α,4-trimethyl-, (S)-; p-Menth-1-en-8-ol, (S)-(-)-; α-Terpineol, (-)-; (-)-α-Terpineol; 2-(4-Methyl-3-cyclohexen-1-yl)-2-propanol, (S)-; 3-Cyclohexene-1-methanol, α,α,4-trimethyl-, (1S)-; α-Terpieol; Alpha terpineol; p-menth-1-en-8-ol; α-terpineol

Phase change data

Data compiled as indicated in comments:
TRC - Thermodynamics Research Center, NIST Boulder Laboratories, Chris Muzny director
AC - William E. Acree, Jr., James S. Chickos
Quantity | Value | Units | Method | Reference | Comment |
---|---|---|---|---|---|
Tfus | 308. | K | N/A | Kay and Perkin, 1906 | Uncertainty assigned by TRC = 4. K; TRC |
Enthalpy of sublimation
ΔsubH (kJ/mol) | Temperature (K) | Method | Reference | Comment |
---|---|---|---|---|
80.3 | 305. | ME | Serpinskii, Voitkevich, et al., 1954 | Based on data from 283. to 328. K. See also Jones, 1960.; AC |

Van Den Dool and Kratz RI, non-polar column, temperature ramp

Column type | Active phase | I | Reference | Comment |
---|---|---|---|---|
Capillary | DB-5 | 1192. | Yu, Liao, et al., 2007 | 30. m/0.25 mm/0.25 μm, He, 3. K/min, 250. C @ 10. min; Tstart: 50. C |
Capillary | HP-5MS | 1187. | Skaltsa, Mavrommati, et al., 2001 | 30. m/0.25 mm/0.25 μm, He, 60. C @ 5. min, 4. K/min; Tend: 280. C |

Normal alkane RI, non-polar column, temperature ramp

Column type | Active phase | I | Reference | Comment |
---|---|---|---|---|
Capillary | OV-101 | 1172. | Orav, Kailas, et al., 2002 | 50. m/0.2 mm/0.5 μm, He, 2. K/min; Tstart: 50. C; Tend: 250. C |

Normal alkane RI, polar column, temperature ramp

Column type | Active phase | I | Reference | Comment |
---|---|---|---|---|
Capillary | Supelcowax-10 | 1690. | Orav, Kailas, et al., 2002 | 60. m/0.2 mm/0.5 μm, He, 2. K/min; Tstart: 70. C; Tend: 220. C |

References

Kay and Perkin, 1906
Kay, F.W.; Perkin, W.H.,
Experiments on the synthesis of the terpenes: viii synthesis of the optically active modifications of delta(3)-p-menthenol(8) and delta(3.8(9)) -p-menthadiene,
J. Chem. Soc., 1906, 89, 839-56. [all data]
Serpinskii, Voitkevich, et al., 1954
Serpinskii, V.V.; Voitkevich, S.A.; Lyuboshits, N.Y.,
Zh. Fiz. Khim., 1954, 28, 810. [all data]
Jones, 1960
Jones, A.H.,
Sublimation Pressure Data for Organic Compounds.,
J. Chem. Eng. Data, 1960, 5, 2, 196-200, https://doi.org/10.1021/je60006a019
. [all data]
Yu, Liao, et al., 2007
Yu, J.Q.; Liao, Z.X.; Cai, X.Q.; Lei, J.C.; Zou, G.L.,
Composition, antimicrobial activity and cytotoxicity of essential oils from Aristolochia mollissima,
Environmental Toxicology and Pharmacology, 2007, 23, 2, 162-167, https://doi.org/10.1016/j.etap.2006.08.004
. [all data]
Skaltsa, Mavrommati, et al., 2001
Skaltsa, H.D.; Mavrommati, A.; Constantinidis, T.,
A chemotaxonomic investigation of volatile constituents in Stachys subsect. Swainsonianeae (Labiatae),
Phytochemistry, 2001, 57, 2, 235-244, https://doi.org/10.1016/S0031-9422(01)00003-6
. [all data]
Orav, Kailas, et al., 2002
Orav, A.; Kailas, T.; Müürisepp, M.,
Composition of blackcurrant aroma isolated from leaves, buds, and berries of Ribes nigrum L.,
Proc. Est. Acad. Sci. Chem., 2002, 51, 4, 225-234. [all data]