1-Hexanol, 2-ethyl-
- Formula: C8H18O
- Molecular weight: 130.2279
- IUPAC Standard InChIKey: YIWUKEYIRIRTPP-UHFFFAOYSA-N
- CAS Registry Number: 104-76-7
- Chemical structure:
View 3d structure (requires JavaScript / HTML 5) - Other names: 2-Ethyl-1-hexanol; 2-Ethylhexan-1-ol; 2-Ethylhexanol; Ethylhexanol; 2-Ethylhexyl alcohol; 2-Ethyl-hexanol-1; Ethylhexyl alcohol; 2-EH; Hexanol, 2-ethyl-; Hexan-1-ol, 2-ethyl; NSC 9300; 2-Ethyl-1-hexyl alcohol; Ethyl-1-hexanol,2-; Octyl alcohol (Related)

Gas phase thermochemistry data

Data compiled by: Donald R. Burgess, Jr.
Quantity | Value | Units | Method | Reference | Comment |
---|---|---|---|---|---|
ΔfH°gas | -87.83 ± 0.53 | kcal/mol | N/A | Tjebbes, 1960 | Value computed using ΔfHliquid° value of -432.88±0.79 kj/mol from Tjebbes, 1960 and ΔvapH° value of 65.4±2 kj/mol from sec-alkanol correlation. |

Condensed phase thermochemistry data

Data compiled as indicated in comments:
ALS - Hussein Y. Afeefy, Joel F. Liebman, and Stephen E. Stein
DH - Eugene S. Domalski and Elizabeth D. Hearing
Quantity | Value | Units | Method | Reference | Comment |
---|---|---|---|---|---|
ΔfH°liquid | -103.46 ± 0.19 | kcal/mol | Ccb | Tjebbes, 1960 | ALS |
Quantity | Value | Units | Method | Reference | Comment |
ΔcH°liquid | -1263.81 ± 0.19 | kcal/mol | Ccb | Tjebbes, 1960 | Corresponding ΔfHºliquid = -103.43 kcal/mol (simple calculation by NIST; no Washburn corrections); ALS |
Quantity | Value | Units | Method | Reference | Comment |
S°liquid | 82.93 | cal/mol*K | N/A | Busygina, Maslova, et al., 1987 | DH |
Constant pressure heat capacity of liquid
Cp,liquid (cal/mol*K) | Temperature (K) | Reference | Comment |
---|---|---|---|
75.88 | 298.15 | Busygina, Maslova, et al., 1987 | T = 13 to 350 K.; DH |

Phase change data

Data compiled as indicated in comments:
BS - Robert L. Brown and Stephen E. Stein
TRC - Thermodynamics Research Center, NIST Boulder Laboratories, Chris Muzny director
AC - William E. Acree, Jr., James S. Chickos
Quantity | Value | Units | Method | Reference | Comment |
---|---|---|---|---|---|
Tboil | 456. ± 4. | K | AVG | N/A | Average of 22 values; Individual data points |
Quantity | Value | Units | Method | Reference | Comment |
Tc | 641. ± 1. | K | N/A | Gude and Teja, 1995 | |
Tc | 641. | K | N/A | Ambrose and Ghiassee, 1990 | Uncertainty assigned by TRC = 2. K; TRC |
Tc | 640.2 | K | N/A | Lawrenson and Lee, 1978 | Uncertainty assigned by TRC = 0.3 K; Visual, decomp.; TRC |
Quantity | Value | Units | Method | Reference | Comment |
Pc | 28. ± 1. | atm | N/A | Gude and Teja, 1995 | |
Pc | 27.63 | atm | N/A | Ambrose and Ghiassee, 1990 | Uncertainty assigned by TRC = 1.97 atm; Calculated from vaper pressure equation at Tc; TRC |
Quantity | Value | Units | Method | Reference | Comment |
ΔvapH° | 16.4 ± 0.05 | kcal/mol | GS | Roganov, Pisarev, et al., 2005 | Based on data from 293. to 331. K.; AC |
Enthalpy of vaporization
ΔvapH (kcal/mol) | Temperature (K) | Method | Reference | Comment |
---|---|---|---|---|
14.4 | 362. | A | Stephenson and Malanowski, 1987 | Based on data from 347. to 457. K. See also Dykvy, Seprakova, et al., 1961.; AC |
12.6 | 388. | N/A | Linek and Wichterle, 1973 | Based on data from 373. to 398. K.; AC |
Antoine Equation Parameters
log10(P) = A − (B / (T + C))
P = vapor pressure (atm)
T = temperature (K)
View plot Requires a JavaScript / HTML 5 canvas capable browser.
Temperature (K) | A | B | C | Reference | Comment |
---|---|---|---|---|---|
347.22 to 456.70 | 4.00818 | 1325.949 | -126.68 | Dykyj, Seprakova, et al., 1961 | Coefficents calculated by NIST from author's data. |

Kovats' RI, non-polar column, isothermal

Column type | Active phase | Temperature (C) | I | Reference | Comment |
---|---|---|---|---|---|
Packed | Apiezon L | 120. | 992. | Bogoslovsky, Anvaer, et al., 1978 | Celite 545 |
Packed | Apiezon L | 160. | 1002. | Bogoslovsky, Anvaer, et al., 1978 | Celite 545 |
Packed | SE-30 | 100. | 1019. | Pías and Gascó, 1975 | Ar, Chromosorb W AW DMCS HP (80-100 mesh); Column length: 1. m |
Packed | SE-30 | 120. | 1015. | Pías and Gascó, 1975 | Ar, Chromosorb W AW DMCS HP (80-100 mesh); Column length: 1. m |
Packed | SE-30 | 140. | 1017. | Pías and Gascó, 1975 | Ar, Chromosorb W AW DMCS HP (80-100 mesh); Column length: 1. m |
Packed | Apiezon L | 130. | 986. | Wehrli and Kováts, 1959 | Celite; Column length: 2.25 m |
Packed | Apiezon L | 190. | 990. | Wehrli and Kováts, 1959 | Celite; Column length: 2.25 m |

Van Den Dool and Kratz RI, non-polar column, temperature ramp

Column type | Active phase | I | Reference | Comment |
---|---|---|---|---|
Capillary | DB-5MS | 1029. | Cho, Namgung, et al., 2008 | 30. m/0.25 mm/0.25 μm, He, 40. C @ 1. min, 4. K/min, 200. C @ 10. min |
Capillary | DB-5MS | 1029. | Cho, Namgung, et al., 2008 | 30. m/0.25 mm/0.25 μm, He, 40. C @ 1. min, 4. K/min, 200. C @ 10. min |
Capillary | DB-5MS | 1029. | Cho I.H., Lee S.M., et al., 2007 | 30. m/0.25 mm/0.25 μm, He, 40. C @ 1. min, 4. K/min, 200. C @ 10. min |
Capillary | SPB-5 | 1030. | Engel and Ratel, 2007 | 60. m/0.32 mm/1. μm, 40. C @ 2. min, 3. K/min, 230. C @ 10. min |
Capillary | DB-Petro | 1010.7 | Pang T., Zhu S., et al., 2007 | 50. m/0.2 mm/0.5 μm, 2. K/min; Tstart: 50. C; Tend: 270. C |
Capillary | DB-Petro | 1010.7 | Pang T., Zhu S., et al., 2007 | 50. m/0.2 mm/0.5 μm, 2. K/min; Tstart: 50. C; Tend: 270. C |
Capillary | HP-5MS | 1026.3 | Zeng, Zhao, et al., 2007 | 30. m/0.25 mm/0.25 μm, He, 4. K/min; Tstart: 80. C; Tend: 300. C |
Capillary | DB-5MS | 1029. | Cho, Kim, et al., 2006 | 30. m/0.25 mm/0.25 μm, He, 40. C @ 1. min, 4. K/min, 200. C @ 10. min |
Capillary | HP-5MS | 1045. | Kallio, Jussila, et al., 2006 | 20. m/0.25 mm/0.25 μm, 60. C @ 4. min, 5. K/min, 240. C @ 15. min |
Capillary | HP-5MS | 1015.2 | Zhao C.X., Li, et al., 2006 | 30. m/0.25 mm/0.25 μm, He, 4. K/min; Tstart: 80. C; Tend: 300. C |
Capillary | RTX-5 | 1016.9 | Ádámová, Orinák, et al., 2005 | 30. m/0.25 mm/0.25 μm, N2, 40. C @ 2. min, 5. K/min, 300. C @ 10. min |
Capillary | BPX-5 | 1037. | Dickschat, Wenzel, et al., 2004 | 25. m/0.22 mm/0.25 μm, He, 50. C @ 5. min, 5. K/min; Tend: 300. C |
Capillary | CP-Sil 8CB-MS | 1037. | Hierro, de la Hoz, et al., 2004 | 60. m/0.25 mm/0.25 μm, 40. C @ 2. min, 4. K/min, 280. C @ 5. min |
Capillary | SPB-Sulfur | 1014.9 | de Lacy Costello, Evans, et al., 2001 | 30. m/0.32 mm/4. μm, 40. C @ 12.5 min, 4. K/min; Tend: 200. C |
Capillary | CP Sil 5 CB | 1019. | Pino and Marbot, 2001 | 50. m/0.32 mm/0.4 μm, He, 60. C @ 10. min, 3. K/min, 280. C @ 60. min |
Capillary | BPX-5 | 1038. | Aaslyng, Elmore, et al., 1998 | 50. m/0.32 mm/0.50 μm, He, 4. K/min; Tstart: 40. C; Tend: 280. C |
Capillary | DB-5 | 1025. | Madruga and Mottram, 1998 | 30. m/0.32 mm/1. μm, 60. C @ 5. min, 4. K/min, 250. C @ 20. min |
Capillary | DB-5 | 1030. | Moio L., Rillo L., et al., 1996 | 30. m/0.32 mm/1. μm, H2, 3. K/min; Tstart: 40. C; Tend: 220. C |
Capillary | DB-5 | 1030. | Moio L., Rillo L., et al., 1996 | 30. m/0.32 mm/1. μm, H2, 3. K/min; Tstart: 40. C; Tend: 220. C |
Capillary | DB-1 | 1020. | Coen, Engel, et al., 1995 | 30. m/0.32 mm/0.25 μm, N2, 3. K/min; Tstart: 150. C; Tend: 280. C |
Capillary | DB-1 | 1020. | Coen, Engel, et al., 1995 | 30. m/0.32 mm/0.25 μm, N2, 3. K/min; Tstart: 150. C; Tend: 280. C |
Capillary | DB-5 | 1028. | Gómez, Ledbetter, et al., 1993 | He, 4. K/min; Column length: 30. m; Column diameter: 0.25 mm; Tstart: 50. C; Tend: 250. C |

Van Den Dool and Kratz RI, non-polar column, custom temperature program

Column type | Active phase | I | Reference | Comment |
---|---|---|---|---|
Capillary | DB-5 | 1028. | Sampaio and Nogueira, 2006 | 30. m/0.25 mm/0.25 μm; Program: 40C(2min) => 4C/min => 220C => 20C/min => 280C |
Capillary | DB-5MS | 1049. | Selli, Rannou, et al., 2006 | 30. m/0.32 mm/0.5 μm, He; Program: 50C => 5C/min => 200C => 8C/min => 260C(5min) |
Capillary | DB-5MS | 1038. | Varlet V., Knockaert C., et al., 2006 | 30. m/0.32 mm/0.5 μm, He; Program: 70C(1min) => 3C/min => 80C(1min) => 5C/min => 150C => 10C/min => 280C (4min) |
Capillary | DB-5MS | 1038. | Varlet V., Knockaert C., et al., 2006 | 30. m/0.32 mm/0.5 μm, He; Program: 70C(1min) => 3C/min => 80C(1min) => 5C/min => 150C => 10C/min => 280C (4min) |
Capillary | HP-5 | 1028. | Boué, Shih, et al., 2003 | 50. m/0.2 mm/0.5 μm, He; Program: 40C(3min) => 10C/min => 60C =3C/min => 150C => 20C/min => 250C (5min) |
Capillary | CP Sil 8 CB | 1031. | Oruna-Concha, Bakker, et al., 2002 | 60. m/0.25 mm/0.25 μm, He; Program: 0C => rapidly => 40C(8min) => 4C/min => 250C(10min) |
Capillary | Ultra-2 | 1030. | Sartin, Halsall, et al., 2001 | 50. m/0.2 mm/0.11 μm; Program: 35C (1min) => 4C/min => 160C => 45C/min => 300C (10min) |
Capillary | DB-5 | 1040. | Parker, Hassell, et al., 2000 | 50. m/0.32 mm/0.5 μm, He; Program: oC(5min) => 60C/min => 60C (5min) => 4C/min => 250C |
Capillary | DB-1 | 1013. | Mattinen, Tuominen, et al., 1995 | 30. m/0.32 mm/1. μm, He; Program: 40C(3min) => 5C/min => 150C => 10C/min => 210C(30min) |
Packed | SE-30 | 1019. | Peng, Ding, et al., 1988 | Supelcoport; Chromosorb; Column length: 3.05 m; Program: 40C(5min) => 10C/min => 200C or 250C (60min) |

Van Den Dool and Kratz RI, polar column, temperature ramp

Column type | Active phase | I | Reference | Comment |
---|---|---|---|---|
Capillary | DB-Wax | 1484. | Cho, Namgung, et al., 2008 | 30. m/0.25 mm/0.25 μm, He, 40. C @ 1. min, 4. K/min, 200. C @ 10. min |
Capillary | DB-Wax | 1484. | Cho, Namgung, et al., 2008 | 30. m/0.25 mm/0.25 μm, He, 40. C @ 1. min, 4. K/min, 200. C @ 10. min |
Capillary | DB-Wax | 1484. | Cho I.H., Lee S.M., et al., 2007 | 60. m/0.25 mm/0.25 μm, He, 40. C @ 1. min, 4. K/min, 200. C @ 10. min |
Capillary | DB-Wax | 1488. | Mahattanatawee K., Perez-Cacho P.R., et al., 2007 | 30. m/0.32 mm/0.5 μm, He, 7. K/min, 240. C @ 5. min; Tstart: 40. C |
Capillary | DB-Wax | 1499. | Pozo-Bayon M.A., Ruiz-Rodriguez A., et al., 2007 | 30. m/0.25 mm/0.5 μm, He, 40. C @ 5. min, 4. K/min, 250. C @ 15. min |
Capillary | DB-Wax | 1484. | Cho, Kim, et al., 2006 | 60. m/0.25 mm/0.25 μm, He, 40. C @ 1. min, 4. K/min, 200. C @ 10. min |
Capillary | DB-Wax | 1480. | Fernandez-Segovia, Escriche, et al., 2006 | 30. m/0.25 mm/0.25 μm, He, 50. C @ 5. min, 10. K/min, 230. C @ 25. min |
Capillary | LM-120 | 1496. | Pinto, Guedes, et al., 2006 | 50. m/0.25 mm/0.5 μm, 3. K/min, 240. C @ 30. min; Tstart: 50. C |
Capillary | DB-Wax | 1470. | Selli, Rannou, et al., 2006 | 30. m/0.25 mm/0.5 μm, He, 4. K/min, 260. C @ 5. min; Tstart: 50. C |
Capillary | CP-Wax 52CB | 1481. | Alasalvar, Taylor, et al., 2005 | 60. m/0.25 mm/0.25 μm, 35. C @ 4. min, 3. K/min; Tend: 203. C |
Capillary | Supelcowax-10 | 1441. | Chung, Fung, et al., 2005 | 60. m/0.25 mm/0.25 μm, 35. C @ 5. min, 6. K/min, 195. C @ 60. min |
Capillary | Stabilwax | 1484. | Cros, Lignot, et al., 2005 | 60. m/0.25 mm/0.25 μm, He, 40. C @ 5. min, 3. K/min, 240. C @ 10. min |
Capillary | DB-Wax | 1505. | Malliaa, Fernandez-Garcia, et al., 2005 | 60. m/0.32 mm/1. μm, He, 45. C @ 1. min, 5. K/min, 250. C @ 12. min |
Capillary | DB-Wax | 1517. | Malliaa, Fernandez-Garcia, et al., 2005 | 60. m/0.32 mm/1. μm, He, 45. C @ 1. min, 5. K/min, 250. C @ 12. min |
Capillary | ZB-Wax | 1491. | Ledauphin, Saint-Clair, et al., 2004 | 30. m/0.25 mm/0.15 μm, He, 35. C @ 10. min, 1.8 K/min, 220. C @ 10. min |
Capillary | OV-351 | 1453. | Bonvehi and Coll, 2003 | 50. m/0.32 mm/0.2 μm, He, 5. K/min; Tstart: 60. C; Tend: 220. C |
Capillary | Stabilwax | 1484. | Cros, Vandanjon, et al., 2003 | 60. m/0.25 mm/0.25 μm, He, 40. C @ 5. min, 3. K/min, 240. C @ 10. min |
Capillary | ZB-Wax | 1446. | Brunton, Cronin, et al., 2002 | 60. m/0.32 mm/0.25 μm, He, 3. K/min; Tstart: 40. C; Tend: 220. C |
Capillary | Supelcowax-10 | 1491. | Chung, Yung, et al., 2002 | 60. m/0.25 mm/0.25 μm, He, 35. C @ 5. min, 2. K/min, 195. C @ 90. min |
Capillary | Supelcowax-10 | 1479. | Moreira, Trugo, et al., 2002 | 30. m/0.25 mm/0.25 μm, He, 3. K/min, 230. C @ 30. min; Tstart: 50. C |
Capillary | Supelcowax-10 | 1491. | Chung, Yung, et al., 2001 | 60. m/0.25 mm/0.25 μm, He, 35. C @ 5. min, 2. K/min, 195. C @ 90. min |
Capillary | AT-Wax | 1474. | Pino and Marbot, 2001 | 60. m/0.32 mm/0.25 μm, He, 65. C @ 10. min, 2. K/min, 250. C @ 60. min |
Capillary | DB-Wax | 1492. | Shimoda, Yoshimura, et al., 2001 | 60. m/0.25 mm/0.25 μm, He, 2. K/min, 230. C @ 60. min; Tstart: 50. C |
Capillary | DB-Wax | 1522. | Beauchene, Grua-Priol, et al., 2000 | 60. m/0.32 mm/0.5 μm, He, 3. K/min, 160. C @ 5. min; Tstart: 30. C |
Capillary | CP-Wax 52CB | 1494. | Chevance, Farmer, et al., 2000 | 60. C @ 5. min, 4. K/min, 220. C @ 30. min; Column length: 50. m; Column diameter: 0.32 mm |
Capillary | Supelcowax-10 | 1493. | Chung, 2000 | 60. m/0.25 mm/0.25 μm, He, 2. K/min, 195. C @ 90. min; Tstart: 35. C |
Capillary | DB-Wax | 1502. | Le Guen, Prost, et al., 2000 | 60. m/0.32 mm/0.5 μm, He, 40. C @ 2. min, 4. K/min, 250. C @ 10. min |
Capillary | CP-Wax 52CB | 1490. | Chevance and Farmer, 1999 | 60. C @ 5. min, 4. K/min, 220. C @ 30. min; Column length: 50. m; Column diameter: 0.32 mm |
Capillary | Supelcowax-10 | 1493. | Chung, 1999 | 60. m/0.25 mm/0.25 μm, He, 35. C @ 5. min, 2. K/min, 195. C @ 90. min |
Capillary | DB-Wax | 1444. | Shimoda, Peralta, et al., 1996 | 60. m/0.25 mm/0.25 μm, He, 3. K/min; Tstart: 50. C; Tend: 230. C |
Capillary | DB-Wax | 1495. | Shimoda, Wu, et al., 1996 | 60. m/0.25 mm/0.25 μm, He, 3. K/min; Tstart: 50. C; Tend: 230. C |
Capillary | DB-Wax | 1473. | Shimoda, Shigematsu, et al., 1995 | 60. m/0.25 mm/0.25 μm, 2. K/min; Tstart: 50. C; Tend: 230. C |
Capillary | DB-Wax | 1491. | Shiratsuchi, Shimoda, et al., 1994 | 60. m/0.25 mm/0.25 μm, 2. K/min, 230. C @ 60. min; Tstart: 50. C |
Capillary | DB-Wax | 1491. | Shiratsuchi, Shimoda, et al., 1994, 2 | 60. m/0.25 mm/0.25 μm, He, 2. K/min, 230. C @ 60. min; Tstart: 50. C |
Capillary | DB-Wax | 1494. | Sumitani, Suekane, et al., 1994 | He, 40. C @ 5. min, 3. K/min; Column length: 60. m; Column diameter: 0.25 mm; Tend: 200. C |
Capillary | Supelcowax-10 | 1489. | Chung and Cadwallader, 1993 | 60. m/0.25 mm/0.25 μm, He, 40. C @ 5. min, 2. K/min, 195. C @ 40. min |
Capillary | DB-Wax | 1491. | Umano, Hagi, et al., 1992 | He, 40. C @ 10. min, 2. K/min; Column length: 30. m; Column diameter: 0.25 mm; Tend: 200. C |
Capillary | CP-Wax 52CB | 1449. | Wu and Liou, 1992 | H2, 50. C @ 10. min, 1.5 K/min, 200. C @ 80. min; Column length: 50. m; Column diameter: 0.32 mm |
Capillary | CP-WAX 57CB | 1493. | Salter L.J., Mottram D.S., et al., 1988 | 60. C @ 5. min, 4. K/min; Column length: 50. m; Column diameter: 0.32 mm; Tend: 200. C |

Van Den Dool and Kratz RI, polar column, custom temperature program

Column type | Active phase | I | Reference | Comment |
---|---|---|---|---|
Capillary | Supelcowax-10 | 1492. | Bianchi, Careri, et al., 2007 | 30. m/0.25 mm/0.25 μm, He; Program: 35C(8min) => 4C/min => 60C => 6C/min => 160C => 20C/min => 200C(1min) |
Capillary | Supelcowax-10 | 1492. | Bianchi, Careri, et al., 2007 | 30. m/0.25 mm/0.25 μm, He; Program: 35C(8min) => 4C/min => 60C => 6C/min => 160C => 20C/min => 200C(1min) |
Capillary | Supelcowax-10 | 1496. | Bianchi, Careri, et al., 2007 | 30. m/0.25 mm/0.25 μm, He; Program: 35C(8min) => 4C/min => 60C => 6C/min => 160C => 20C/min => 200C(1min) |
Capillary | CP-Wax 52CB | 1483. | Romeo, Ziino, et al., 2007 | 60. m/0.25 mm/0.25 μm, He; Program: 45C(5min) => 10C/min => 80C => 2C/min => 240C |
Capillary | DB-Wax | 1492. | Guillot, Peytavi, et al., 2006 | 30. m/0.25 mm/0.25 μm, He; Program: 60C => 5C/min => 200C => 6C/min => 250C(5min) |
Capillary | SOLGel-Wax | 1488. | Aubert, Baumann, et al., 2005 | 30. m/0.25 mm/0.25 μm, He; Program: 35C(5min) => 3C/min => 150C => 5C/min => 250C (10min) |
Capillary | DB-Wax | 1518. | Hallier, Prost, et al., 2005 | 30. m/0.32 mm/0.5 μm, He; Program: 40C(5min) => 10C/min => 160C => 15C/min => 230C |
Capillary | FFAP | 1504. | Ranau and Steinhart, 2005 | 60. m/0.25 mm/0.5 μm, He; Program: 50C(3min) => 3C/min => 100C => 10C/min => 220C (13.5min) |
Capillary | CP-Wax 52CB | 1488. | Verzera, Ziino, et al., 2004 | 60. m/0.25 mm/0.25 μm, He; Program: 45C(5min) => 10C/min => 80C => 2C/min => 240C |
Capillary | DB-Wax | 1490. | Pennarun, Prost, et al., 2003 | 30. m/0.32 mm/0.5 μm, He; Program: 50C => 6C/min => 70C => 4C/min => 150C => 10C/min => 250C |
Capillary | DB-Wax | 1490. | Pennarun, Prost, et al., 2002 | 30. m/0.32 mm/0.5 μm, He; Program: 50C => 6C/min => 70C => 4C/min => 150C => 10C/min => 250C |
Capillary | DB-Wax | 1481. | Cantergiani, Brevard, et al., 2001 | 30. m/0.25 mm/0.25 μm; Program: 20C(30s) => fast => 60C => 4C/min => 220C (20min) |
Capillary | Innowax | 1474. | Larráyoz, Addis, et al., 2001 | 60. m/0.22 mm/0.25 μm, He; Program: 35C (1min) => 3C/min => 170C => 4C/min => 200C (20min) |
Capillary | DB-Wax | 1518. | Ziegleder, 2001 | He; Column length: 60. m; Column diameter: 0.25 mm; Program: 45C(4min) => 30C/min => 60C (5min) => 3C/min => 220C (40min) |
Capillary | CP-Wax 52CB | 1490. | Madruga and Mottram, 1998 | 50. m/0.32 mm/0.21 μm; Program: 0C(5min) => fast => 60C(5min) => 4C/min => 220C(20min) |
Capillary | Supelcowax-10 | 1489. | Baek and Cadwallader, 1996 | 60. m/0.25 mm/0.25 μm; Program: 40C => (6C/min) => 80C(6min) => (15C/min) => 200C(10min) |
Capillary | Carbowax 20M | 1450. | Whitfield, Shea, et al., 1981 | Column length: 150. m; Column diameter: 0.75 mm; Program: not specified |

Normal alkane RI, non-polar column, isothermal

Column type | Active phase | Temperature (C) | I | Reference | Comment |
---|---|---|---|---|---|
Packed | SE-30 | 100. | 1019. | Zhou and Wu, 2007 | Column length: 1. m |
Packed | DC-400 | 150. | 1016. | Anderson, 1968 | Helium, Gas-Pak (60-80 mesh); Column length: 3.0 m |

Normal alkane RI, non-polar column, temperature ramp

Column type | Active phase | I | Reference | Comment |
---|---|---|---|---|
Capillary | HP-5 MS | 1031. | Wanakhachornkrai and Lertsiri, 9999 | 30. m/0.25 mm/0.25 μm, Helium, 15. K/min; Tstart: 45. C; Tend: 280. C |
Capillary | Optima-5 MS | 1029. | Goeminne, Vandendriessche, et al., 2012 | 30. m/0.25 mm/0.25 μm, Helium, 35. C @ 3. min, 10. K/min, 250. C @ 5. min |
Capillary | VF-5 MS | 1031. | Leffingwell and Alford, 2011 | 60. m/0.32 mm/0.25 μm, Helium, 2. K/min, 260. C @ 28. min; Tstart: 30. C |
Capillary | VF-5 MS | 1034. | Leffingwell and Alford, 2011 | 60. m/0.32 mm/0.25 μm, Helium, 2. K/min, 260. C @ 28. min; Tstart: 30. C |
Capillary | VF-5 MS | 1033. | Liu, Lu, et al., 2011 | 30. m/0.25 mm/0.25 μm, Helium, 40. C @ 3. min, 5. K/min, 250. C @ 3. min |
Capillary | HP-5 MS | 1027. | Miyazawa, Marumoto, et al., 2011 | 30. m/0.25 mm/0.25 μm, Helium, 4. K/min, 260. C @ 5. min; Tstart: 40. C |
Capillary | OV-1 | 1018. | Hu, Liang, et al., 2010 | 30. m/0.25 mm/0.25 μm, Helium, 50. C @ 3. min, 5. K/min, 250. C @ 2. min |
Capillary | HP-5 MS | 1035. | Jerkovic and Marijanovic, 2010 | 30. m/0.25 mm/0.25 μm, Helium, 70. C @ 2. min, 3. K/min, 200. C @ 18. min |
Capillary | HP-5 MS | 1027. | Radulovic, Blagojevic, et al., 2010 | 30. m/0.25 mm/0.25 μm, Helium, 5. K/min, 290. C @ 10. min; Tstart: 70. C |
Capillary | HP-5 MS | 1025. | Radulovic, Dordevic, et al., 2010 | 30. m/0.25 mm/0.25 μm, Helium, 5. K/min, 290. C @ 10. min; Tstart: 70. C |
Capillary | DB-5 MS | 1025. | Silva, Pott, et al., 2010 | 30. m/0.25 mm/0.25 μm, Helium, 3. K/min; Tstart: 60. C; Tend: 240. C |
Capillary | VF-5 | 1035. | Li and Zhao, 2009 | 30. m/0.25 mm/0.25 μm, Helium, 60. C @ 2. min, 10. K/min, 300. C @ 10. min |
Capillary | Mega 5 MS | 1032. | Romeo, Verzera, et al., 2009 | 60. m/0.25 mm/0.25 μm, Helium, 40. C @ 2. min, 3. K/min; Tend: 240. C |
Capillary | HP-5 MS | 1031. | Forero, Quijano, et al., 2008 | 30. m/0.25 mm/0.25 μm, Helium, 50. C @ 4. min, 4. K/min, 230. C @ 10. min |
Capillary | RTX-5 | 1060. | Pham, Schilling, et al., 2008 | 30. m/0.25 mm/0.25 μm, He, 40. C @ 5. min, 20. K/min; Tend: 250. C |
Capillary | DB-5 | 1032. | Gogus, Ozel, et al., 2007 | 60. m/0.32 mm/1.0 μm, Helium, 35. C @ 7. min, 15. K/min, 240. C @ 10. min |
Capillary | RTX-5 | 1034. | Setkova, Risticevic, et al., 2007 | 10. m/0.18 mm/0.2 μm, He, 40. C @ 0.5 min, 50. K/min, 275. C @ 0.5 min |
Capillary | SPB-5 | 980. | Vasta, Ratel, et al., 2007 | 60. m/0.32 mm/1. μm, 40. C @ 5. min, 3. K/min, 230. C @ 5. min |
Capillary | SPB-5 | 1030. | Vasta, Ratel, et al., 2007 | 60. m/0.32 mm/1. μm, 40. C @ 5. min, 3. K/min, 230. C @ 5. min |
Capillary | DB-5 | 1033. | Fan and Qian, 2006 | 30. m/0.32 mm/1. μm, N2, 40. C @ 2. min, 6. K/min, 230. C @ 15. min |
Capillary | DB-5 | 1034. | Morteza-Semnani, Saeedi, et al., 2006 | 30. m/0.25 mm/0.25 μm, He, 60. C @ 4. min, 4. K/min; Tend: 260. C |
Capillary | RTX-5Sil | 1032. | Holland, Larkov, et al., 2005 | 30. m/0.25 mm/0.25 μm, He, 45. C @ 5. min, 3. K/min; Tend: 200. C |
Capillary | CP Sil 5 CB | 1033. | Rohloff and Bones, 2005 | 30. m/0.25 mm/0.25 μm, He, 40. C @ 1. min, 4. K/min; Tend: 220. C |
Capillary | HP-5 | 1026. | N/A | 30. m/0.32 mm/0.25 μm, Helium, 40. C @ 2. min, 5. K/min, 250. C @ 5. min |
Capillary | 5 % Phenyl methyl siloxane | 1028. | Ramírez, Estévez, et al., 2004 | 0. m/0.25 mm/1. μm, He, 40. C @ 10. min, 7. K/min, 250. C @ 5. min |
Capillary | DB-5MS | 1043. | Robledo and Arzuffi, 2004 | 30. m/0.25 mm/0.25 μm, 30. K/min, 200. C @ 10. min; Tstart: 90. C |
Capillary | DB-5 | 1024. | Dhanda, Pegg, et al., 2003 | 60. m/0.25 mm/0.25 μm, He, 35. C @ 2. min, 5. K/min, 280. C @ 4. min |
Capillary | SPB-5 | 1026. | Sebastian, Viallon-Fernandez, et al., 2003 | 60. m/0.32 mm/1.0 μm, Helium, 3. K/min; Tstart: 30. C; Tend: 230. C |
Capillary | HP-5 | 1031. | Wanakhachornkrai and Lertsiri, 2003 | 30. m/0.25 mm/0.25 μm, He, 45. C @ 2. min, 15. K/min, 280. C @ 11.4 min |
Capillary | BP-1 | 998. | Hayes R.A., Richardson B.J., et al., 2002 | 25. m/0.2 mm/0.1 μm, He, 40. C @ 5. min, 8. K/min; Tend: 250. C |
Capillary | HP-5 | 1014. | García, Martín, et al., 2000 | 60. m/0.32 mm/1. μm, He, 3. K/min; Tstart: 40. C; Tend: 240. C |
Capillary | SPB-5 | 1042. | Kim, Kim, et al., 2000 | 60. m/0.25 mm/0.25 μm, He, 70. C @ 8. min, 5. K/min, 240. C @ 20. min |
Capillary | Methyl Silicone | 1016.10 | Baraldi, Rapparini, et al., 1999 | 60. m/0.25 mm/0.25 μm, 40. C @ 10. min, 5. K/min; Tend: 220. C |
Capillary | DB-1 | 1015. | Robacker and Bartelt, 1997 | 30. m/0.32 mm/0.5 μm, He, 35. C @ 1. min, 10. K/min; Tend: 200. C |
Capillary | SE-54 | 1038. | Huang, Liang, et al., 1996 | 36. m/0.25 mm/0.25 μm, 5. K/min; Tstart: 35. C; Tend: 240. C |
Capillary | SPB-1 | 1012. | Wong and Lai, 1996 | 50. m/0.2 mm/0.33 μm, He, 40. C @ 3. min, 3. K/min, 200. C @ 30. min |
Capillary | Ultra-2 | 1034. | King, Matthews, et al., 1995 | 50. m/0.32 mm/0.52 μm, He, 40. C @ 3. min, 4. K/min, 250. C @ 30. min |
Capillary | DB-5 MS | 1028. | Gomez and Ledbetter, 1994 | Helium, 4. K/min; Column length: 30. m; Column diameter: 0.25 mm; Tstart: 50. C; Tend: 250. C |
Capillary | Ultra-2 | 1033. | King, Hamilton, et al., 1993 | 50. m/0.32 mm/0.52 μm, He, 40. C @ 3. min, 4. K/min, 250. C @ 30. min |
Capillary | DB-5 | 1030. | Moio, Dekimpe, et al., 1993 | 30. m/0.32 mm/1. μm, H2, 3. K/min; Tstart: 40. C; Tend: 220. C |
Capillary | DB-5 | 1030. | Moio, Dekimpe, et al., 1993 | 30. m/0.32 mm/1. μm, H2, 3. K/min; Tstart: 40. C; Tend: 220. C |
Capillary | DB-1 | 1012. | Shiota, 1991 | 60. m/0.25 mm/0.25 μm, He, 3. K/min; Tstart: 50. C; Tend: 240. C |
Capillary | DB-1 | 1012. | Shiota, 1991 | 60. m/0.25 mm/0.25 μm, He, 3. K/min; Tstart: 50. C; Tend: 240. C |
Capillary | DB-1 | 1015. | Shiota, 1991 | 60. m/0.25 mm/0.25 μm, He, 3. K/min; Tstart: 50. C; Tend: 240. C |
Capillary | DB-1 | 1018. | Shiota, 1991 | 60. m/0.25 mm/0.25 μm, He, 3. K/min; Tstart: 50. C; Tend: 240. C |
Capillary | DB-1 | 1016. | Habu, Flath, et al., 1985 | 3. K/min; Column length: 50. m; Column diameter: 0.32 mm; Tstart: 0. C; Tend: 250. C |
Capillary | OV-101 | 1064. | Stern, Flath, et al., 1985 | 50. C @ 0.1 min, 4. K/min, 225. C @ 30. min; Column length: 50. m; Column diameter: 0.32 mm |
Capillary | DB-1 | 1013. | Flath, Mon, et al., 1983 | 50. C @ 0.1 min, 4. K/min, 250. C @ 5. min; Column length: 60. m; Column diameter: 0.32 mm |

Normal alkane RI, non-polar column, custom temperature program

Column type | Active phase | I | Reference | Comment |
---|---|---|---|---|
Capillary | SLB-5 MS | 1030. | Mondello, 2012 | 30. m/0.25 mm/0.25 μm, Helium; Program: not specified |
Capillary | SLB-5 MS | 1030. | Mondello, 2012 | 30. m/0.25 mm/0.25 μm, Helium; Program: not specified |
Capillary | Polydimethyl siloxane with 5 % Ph groups | 1030. | Robinson, Adams, et al., 2012 | Program: not specified |
Capillary | Polydimethyl siloxane with 5 % Ph groups | 1035. | Robinson, Adams, et al., 2012 | Program: not specified |
Capillary | Siloxane, 5 % Ph | 1020. | VOC BinBase, 2012 | Program: not specified |
Capillary | VF-5 MS | 1040. | Liu, Lu, et al., 2011 | 30. m/0.25 mm/0.25 μm, Helium; Program: not specified |
Capillary | Polydimethyl siloxane, 5 % phenyl | 1020. | Skogerson, Wohlgemuth, et al., 2011 | Program: not specified |
Capillary | HP-5 MS | 1039. | Fan, Lu, et al., 2009 | 30. m/0.25 mm/0.25 μm, Helium; Program: 40 0C (3 min) 3 0C/min -> 160 0C (2 min) 8 0C/min -> 220 0C (3 min) |
Capillary | BPX-5 | 1031. | Ortiz, Echeverra, et al., 2009 | 30. m/0.25 mm/0.25 μm, Helium; Program: 70 0C (1 min) 3 0C/min -> 142 0C 5 0C/min -> 225 0C (10 min) |
Capillary | ZB-5 | 1032. | de Simon, Estruelas, et al., 2009 | 30. m/0.25 mm/0.25 μm, Helium; Program: 45 0C 3 0C/min -> 230 0C (10 min) 10 0C/min -> 270 0C (21 min) |
Capillary | OV-1 | 1015. | Zhang and Liang, 2009 | 30. m/0.25 mm/0.25 μm, Helium; Program: 30 0C (50 min) 2 0C/min -> 90 0C 30 0C/min -> 300 0C (3 min) |
Capillary | DB-5 MS | 1031. | Watanabe, Ueda, et al., 2008 | 30. m/0.32 mm/1.0 μm, Helium; Program: -10 0C (3 min) 50 0C/min -> 40 0C 5 0C/min -> 290 0C (5 min) |
Capillary | HP-1 | 1008. | Barra, Baldovini, et al., 2007 | 50. m/0.2 mm/0.33 μm, He; Program: 40C(2min) => 2C/min => 200C => 15C/min => 250C (30min) |
Capillary | Methyl Silicone | 1019. | Chen and Feng, 2007 | Program: not specified |
Capillary | HP-5 | 1031. | Dou, Li, et al., 2007 | 30. m/0.32 mm/0.25 μm, He; Program: 40 0C (2 min) 110 0C (2 min) 3 0C/min -> 170 0C (2 min) 4 0C/min -> 220 0C (2 min) 10 0C/min -> 260 0C (5 min) |
Capillary | DB-5 MS | 1028. | Liu, Xu, et al., 2007 | 60. m/0.32 mm/1.0 μm, Helium; Program: 40 0C (2 min) 6 0C/min -> 100 0C 4 0C/min -> 180 0C 8 0C/min -> 250 0C (12 min) |
Capillary | HP-5 | 1019. | Splivallo, Bossi, et al., 2007 | He; Program: 50C => 3C/min => 200C(10min) => 10C/min => 290C(10min) |
Capillary | 5 % Phenyl methyl siloxane | 1031. | Beaulieu J.C. and Lea J.M., 2006 | 30. m/0.25 mm/0.75 μm; Program: 50C(1min) => 5C/min => 100C => 10C/min => 190C => 30C/min => 250C(1min) |
Capillary | Methyl Silicone | 1019. | Kou, Zhang, et al., 2006 | Program: not specified |
Capillary | RTX-5 | 1015. | Ádámová, Orinák, et al., 2005 | 30. m/0.25 mm/0.25 μm, N2; Program: not specified |
Capillary | Methyl Silicone | 1048. | Blunden, Aneja, et al., 2005 | 60. m/0.32 mm/1.0 μm, Helium; Program: -50 0C (2 min) 8 0C/min -> 200 0C (7.75 min) 25 0C -> 225 0C (8 min) |
Capillary | BPX-5 | 1043. | Duflos, Moine, et al., 2005 | 60. m/0.25 mm/0.25 μm, He; Program: 40C(5min) => 5C/min => 100C => 20C/min => 280C (5min) |
Capillary | HP-5 | 1030. | Garcia-Estaban, Ansorena, et al., 2004 | 50. m/0.32 mm/1.05 μm; Program: 40C(10min) => 5C/min => 200C => 20C/min => 250C(5min) |
Capillary | DB-5 | 1030. | Garcia-Estaban, Ansorena, et al., 2004, 2 | 50. m/0.32 mm/1.05 μm; Program: 40C(10min) => 5C/min => 200C => 20C/min => 250C (5min) |
Capillary | SPB-5 | 1028. | Begnaud, Pérès, et al., 2003 | 60. m/0.32 mm/1. μm; Program: not specified |
Capillary | DB-5 | 1028. | Chung, Heymann, et al., 2003 | 60. m/0.25 mm/0.25 μm; Program: 35C => 5C/min => 120C => 2C/min => 160C => 7C/min => 250C |
Capillary | Polydimethyl siloxane | 1013. | Junkes, Castanho, et al., 2003 | Program: not specified |
Capillary | BPX-5 | 1029. | Machiels, van Ruth, et al., 2003 | 60. m/0.32 mm/1. μm, He; Program: 40C (4min) => 2C/min => 90C => 4C/min => 130C => 8C/min => 250 C (10min) |
Capillary | DB-1 | 1020. | Variyar, Ahmad, et al., 2003 | 30. m/0.25 mm/0.25 μm, He; Program: 60C => 4C/min => 200C (5min) => 10C/min => 280C (20min) |
Capillary | HP-5MS | 1034. | Ansorena, Gimeno, et al., 2001 | 30. m/0.25 mm/0.25 μm, He; Program: 40C (10min) => 3C/min => 120C => 10C/min => 250C (5min) |
Capillary | BPX-5 | 1038. | Madruga, Arruda, et al., 2000 | 50. m/0.32 mm/0.50 μm, Helium; Program: 40 0C (5 min) 20 0C/min -> 60 0C (5 min) 4 0C/min -> 250 0C (10 min) |
Capillary | HP-5 | 1033. | Timón, Ventanas, et al., 1998 | 50. m/0.32 mm/0.52 μm, He; Program: 35 0C 10 0C/min -> 200 0C (20 min) 5 0C/min -> 230 0C (50 min) |
Capillary | RSL-150 | 1020. | Buchbauer, Nikiforov, et al., 1994 | 60. m/0.32 mm/0.25 μm, He; Program: 30c (1.5min) => 20C/min => 55C => 6C/min => 200C(10min) |
Capillary | DB-1 | 1015. | Ciccioli, Cecinato, et al., 1994 | 60. m/0.32 mm/0.25 μm; Program: not specified |
Capillary | DB-1 | 1015. | Ciccioli, Brancaleoni, et al., 1993 | 60. m/0.32 mm/0.25 μm; Program: 3 min at 5 C; 5 - 50 C at 3 deg/min; 50 - 220 C at 5 deg/min |
Capillary | SE-30 | 1014. | Ibrahim and Suffet, 1988 | N2; Column length: 60. m; Column diameter: 0.32 mm; Program: 50C(8min) => 3C/min => 150C => 35C/min => 275C (10min) |
Capillary | DB-1 | 1018. | Takeoka, Flath, et al., 1988 | 30. m/0.25 mm/0.25 μm, H2; Program: 30C (2min) => 2C/min => 150C => 4C/min => 250C |
Capillary | DB-1 | 1018. | Takeoka, Flath, et al., 1988 | 30. m/0.25 mm/0.25 μm, H2; Program: 30C (2min) => 2C/min => 150C => 4C/min => 250C |
Capillary | OV-1 | 1037. | Ramsey and Flanagan, 1982 | Program: not specified |

Normal alkane RI, polar column, temperature ramp

Column type | Active phase | I | Reference | Comment |
---|---|---|---|---|
Capillary | HP-FFAP | 1502. | Wanakhachornkrai and Lertsiri, 9999 | 25. m/0.32 mm/0.50 μm, Helium, 15. K/min; Tstart: 45. C; Tend: 220. C |
Capillary | HP-FFAP | 1503. | Wanakhachornkrai and Lertsiri, 9999 | 25. m/0.32 mm/0.50 μm, Helium, 15. K/min; Tstart: 45. C; Tend: 220. C |
Capillary | HP-FFAP | 1503. | Wanakhachornkrai and Lertsiri, 9999 | 25. m/0.32 mm/0.50 μm, Helium, 15. K/min; Tstart: 45. C; Tend: 220. C |
Capillary | HP-Innowax | 1490. | Feng, Zhuang, et al., 2011 | 60. m/0.25 mm/0.25 μm, Helium, 60. C @ 1. min, 3. K/min, 220. C @ 5. min |
Capillary | VF-Wax MS | 1486. | Duarte, Dias, et al., 2010 | 60. m/0.25 mm/0.25 μm, Helium, 60. C @ 5. min, 3. K/min, 220. C @ 25. min |
Capillary | DB-Wax | 1483. | Karlsson, Birgersson, et al., 2009 | 30. m/0.25 mm/0.25 μm, Hydrogen, 30. C @ 5. min, 8. K/min, 230. C @ 10. min |
Capillary | CP-Wax | 1462. | Mo, Fan, et al., 2009 | 60. m/0.25 mm/0.25 μm, Helium, 50. C @ 2. min, 6. K/min, 230. C @ 15. min |
Capillary | DB-Wax | 1488. | Zhao, Xu, et al., 2009 | 30. m/0.25 mm/0.25 μm, Helium, 40. C @ 2. min, 3. K/min, 230. C @ 5. min |
Capillary | Innowax | 1503. | Kaypak and Avsar, 2008 | 30. m/0.25 mm/0.25 μm, 40. C @ 5. min, 10. K/min, 200. C @ 15. min |
Capillary | Stabilwax | 1484. | Cros, Vandanjon, et al., 2007 | 60. m/0.25 mm/0.25 μm, Helium, 40. C @ 5. min, 3. K/min, 240. C @ 10. min |
Capillary | DB-Wax | 1501. | Dury-Brun, Fournier, et al., 2007 | 30. m/0.32 mm/0.5 μm, He, 5. K/min; Tstart: 40. C; Tend: 240. C |
Capillary | BP-20 | 1494. | Rawat, Gulati, et al., 2007 | 30. m/0.25 mm/0.25 μm, He, 70. C @ 4. min, 4. K/min, 220. C @ 5. min |
Capillary | DB-Wax | 1474. | Fan and Qian, 2006, 2 | 30. m/0.32 mm/0.25 μm, He, 40. C @ 2. min, 4. K/min, 230. C @ 15. min |
Capillary | DB-Wax | 1495. | Fan and Qian, 2006 | 30. m/0.32 mm/0.25 μm, N2, 40. C @ 2. min, 6. K/min, 230. C @ 15. min |
Capillary | HP-Innowax | 1472. | Komes, Ulrich, et al., 2006 | 30. m/0.25 mm/0.5 μm, He, 40. C @ 3. min, 2. K/min, 200. C @ 15. min |
Capillary | DB-Wax Etr | 1515. | Perestrelo, Fernandes, et al., 2006 | 30. m/0.25 mm/0.25 μm, He, 40. C @ 1. min, 2. K/min, 220. C @ 10. min |
Capillary | ZB-Wax | 1505. | Wierda R.L., Fletcher G., et al., 2006 | 60. m/0.32 mm/0.5 μm, He, 40. C @ 2. min, 3. K/min, 250. C @ 10. min |
Capillary | ZB-Wax | 1476. | N/A | 30. m/0.32 mm/0.25 μm, Helium, 40. C @ 2. min, 5. K/min, 250. C @ 5. min |
Capillary | ZB-Wax | 1476. | Wu, Krings, et al., 2005 | 30. m/0.32 mm/0.25 μm, He, 40. C @ 2. min, 5. K/min, 250. C @ 10. min |
Capillary | DB-Wax | 1512. | Chida, Sone, et al., 2004 | 60. m/0.25 mm/0.5 μm, 35. C @ 5. min, 4. K/min, 240. C @ 10. min |
Capillary | DB-Wax | 1499. | López, Ezpeleta, et al., 2004 | 60. m/0.25 mm/0.25 μm, He, 40. C @ 5. min, 3. K/min; Tend: 220. C |
Capillary | Stabilwax | 1484. | Cros, Vandanjon, et al., 2003, 2 | 60. m/0.25 mm/0.25 μm, Helium, 40. C @ 5. min, 3. K/min, 240. C @ 10. min |
Capillary | DB-Wax | 1490. | Dregus and Engel, 2003 | 60. m/0.32 mm/0.25 μm, H2, 40. C @ 5. min, 4. K/min, 230. C @ 25. min |
Capillary | DB-Wax | 1487. | Lee and Noble, 2003 | 30. m/0.25 mm/0.25 μm, He, 40. C @ 4. min, 4. K/min, 185. C @ 20. min |
Capillary | DB-Wax | 1495. | Lin, Cai, et al., 2003 | 30. m/0.25 mm/0.25 μm, He, 50. C @ 2. min, 3. K/min, 230. C @ 20. min |
Capillary | Carbowax 20M | 1484. | Soria, Martinez-Castro, et al., 2003 | 50. m/0.25 mm/0.25 μm, He, 45. C @ 2. min, 4. K/min, 190. C @ 50. min |
Capillary | DB-Wax | 1495. | Tanaka, Yamauchi, et al., 2003 | 30. m/0.25 mm/0.25 μm, 30. C @ 1. min, 4. K/min; Tend: 250. C |
Capillary | DB-Wax | 1496. | Tanaka, Yamauchi, et al., 2003 | 30. m/0.25 mm/0.25 μm, 30. C @ 1. min, 4. K/min; Tend: 250. C |
Capillary | HP-FFAP | 1503. | Wanakhachornkrai and Lertsiri, 2003 | 25. m/0.32 mm/0.5 μm, He, 15. K/min; Tstart: 45. C; Tend: 220. C |
Capillary | HP-FFAP | 1503. | Wanakhachornkrai and Lertsiri, 2003 | 25. m/0.32 mm/0.5 μm, He, 15. K/min; Tstart: 45. C; Tend: 220. C |
Capillary | HP-FFAP | 1502. | Wanakhachornkrai and Lertsiri, 2003 | 25. m/0.32 mm/0.5 μm, He, 15. K/min; Tstart: 45. C; Tend: 220. C |
Capillary | DB-Wax | 1491. | Fu, Yoon, et al., 2002 | 30. m/0.25 mm/0.25 μm, He, 40. C @ 5. min, 8. K/min, 250. C @ 5. min |
Capillary | RTX-Wax | 1493. | Galindo-Cuspinera, Lubran, et al., 2002 | 60. m/0.25 mm/0.5 μm, He, 40. C @ 5. min, 5. K/min, 180. C @ 20. min |
Capillary | HP-Wax | 1509. | Sanz, Maeztu, et al., 2002 | 60. m/0.25 mm/0.5 μm, He, 40. C @ 6. min, 3. K/min; Tend: 190. C |
Capillary | DB-Wax | 1481. | Umano, Hagi, et al., 2002 | 60. m/0.25 mm/0.25 μm, He, 40. C @ 2. min, 2. K/min; Tend: 200. C |
Capillary | DB-Wax | 1475. | Duque, Bonilla, et al., 2001 | 30. m/0.25 mm/0.25 μm, Helium, 4. K/min, 220. C @ 30. min; Tstart: 25. C |
Capillary | HP-Wax | 1509. | Maeztu, Sanz, et al., 2001 | 60. m/0.25 mm/0.5 μm, He, 40. C @ 6. min, 3. K/min; Tend: 190. C |
Capillary | Supelcowax-10 | 1492. | Girard and Durance, 2000 | 60. m/0.25 mm/0.25 μm, He, 35. C @ 10. min, 4. K/min; Tend: 200. C |
Capillary | Supelcowax-10 | 1490. | Kim, Kim, et al., 2000 | 30. m/0.32 mm/0.25 μm, He, 70. C @ 8. min, 5. K/min, 240. C @ 20. min |
Capillary | DB-Wax | 1492. | Umano, Hagi, et al., 2000 | 60. m/0.25 mm/0.25 μm, He, 40. C @ 2. min, 2. K/min; Tend: 200. C |
Capillary | CP-Wax 52CB | 1458. | Hwan and Chou, 1999 | 50. m/0.32 mm/0.22 μm, H2, 60. C @ 4. min, 2. K/min, 190. C @ 21. min |
Capillary | Innowax | 1495. | Kaya, Baser, et al., 1999 | 60. m/0.25 mm/0.25 μm, He, 60. C @ 10. min; Tend: 220. C |
Capillary | DB-Wax | 1490. | Umano, Nakahara, et al., 1999 | 60. m/0.25 mm/0.25 μm, He, 40. C @ 2. min, 2. K/min; Tend: 200. C |
Capillary | Supelcowax-10 | 1505. | Campeanu, Burcea, et al., 1998 | 60. m/0.32 mm/0.5 μm, H2, 35. C @ 5. min, 5. K/min, 250. C @ 20. min |
Capillary | DB-Wax | 1491. | Sekiwa, Kubota, et al., 1997 | He, 2. K/min; Column length: 60. m; Column diameter: 0.25 mm; Tstart: 60. C; Tend: 180. C |
Capillary | DB-Wax | 1483. | Wada and Shibamoto, 1997 | He, 3. K/min, 200. C @ 40. min; Column length: 60. m; Column diameter: 0.25 mm; Tstart: 50. C |
Capillary | PEG-20M | 1461. | Kubota, Matsujage, et al., 1996 | 50. m/0.25 mm/0.25 μm, Nitrogen, 2. K/min; Tstart: 60. C; Tend: 180. C |
Capillary | TC-Wax | 1487. | Shuichi, Masazumi, et al., 1996 | 80. C @ 5. min, 3. K/min; Column length: 60. m; Column diameter: 0.25 mm; Tend: 240. C |
Capillary | Supelcowax-10 | 1491. | Wong and Lai, 1996 | 60. m/0.25 mm/0.25 μm, He, 40. C @ 3. min, 3. K/min, 200. C @ 30. min |
Capillary | Carbowax 20M | 1453. | Kawakami, Ganguly, et al., 1995 | 60. C @ 4. min, 2. K/min; Column length: 60. m; Column diameter: 0.25 mm; Tend: 180. C |
Capillary | Carbowax 20M | 1453. | Kawakami, Kobayashi, et al., 1993 | He, 60. C @ 4. min, 2. K/min; Column length: 50. m; Column diameter: 0.25 mm; Tend: 180. C |
Capillary | Carbowax 20M | 1453. | Kawakami and Kobayashi, 1991 | He, 60. C @ 4. min, 2. K/min; Column length: 50. m; Column diameter: 0.25 mm; Tend: 180. C |

Normal alkane RI, polar column, custom temperature program

Column type | Active phase | I | Reference | Comment |
---|---|---|---|---|
Capillary | DB-Wax | 1491. | Gyawali and Kim, 2012 | 60. m/0.20 mm/0.25 μm, Helium; Program: 40 0C (3 min) 2 0C/min -> 150 0C 4 0C/min -> 220 0C (20 min) 5 0C/min -> 230 0C |
Capillary | Supelco CO Wax-10 | 1515. | Prompona, Kandylis, et al., 2012 | 60. m/0.32 mm/0.25 μm, Helium; Program: 35 0C (6 min) 2 0C/min -> 60 0C (5 min) 5 0C/min -> 200 0C 25 0C/min -> 250 0C (6 min) |
Capillary | Supelco CO Wax-10 | 1520. | Prompona, Kandylis, et al., 2012 | 60. m/0.32 mm/0.25 μm, Helium; Program: not specified |
Capillary | DB-Wax | 1483. | Welke, Manfroi, et al., 2012 | 30. m/0.25 mm/0.25 μm, Helium; Program: not specified |
Capillary | DB-Wax | 1491. | Welke, Manfroi, et al., 2012 | 30. m/0.25 mm/0.25 μm, Helium; Program: not specified |
Capillary | HP-Innowax | 1496. | Feng, Zhuang, et al., 2011 | 60. m/0.25 mm/0.25 μm, Helium; Program: not specified |
Capillary | SOLGel-Wax | 1495. | Johanningsmeier and McFeeters, 2011 | 30. m/0.25 mm/0.25 μm, Helium; Program: 40 0C (2 min) 5 0C/min -> 140 0C 10 0C/min -> 250 0C (3 min) |
Capillary | SOLGel-Wax | 1492. | Johanningsmeier and McFeeters, 2011 | 30. m/0.25 mm/0.25 μm, Helium; Program: not specified |
Capillary | DB-Wax | 1502. | Sampaio, Garruti, et al., 2011 | 30. m/0.25 mm/0.25 μm, Hydrogen; Program: 35 0C (9 min) 5 0C/min -> 80 0C 1 0C/min -> 100 0C 16 0C/min -> 210 0C (20 min) |
Capillary | HP-Innowax | 1496. | Xiao, Dai, et al., 2011 | 60. m/0.25 mm/0.25 μm, Helium; Program: 40 0C (2 min) 3 0C/min -> 150 0C 5 0C/min -> 220 0C (5 min) |
Capillary | Supelko CO Wax | 1504. | Vekiari, Orepoulou, et al., 2010 | 60. m/0.32 mm/0.25 μm, Helium; Program: 40 0C (5 min) 4 0C/min -> 75 0C 5 0C/min -> 250 0C (10 min) |
Capillary | Supelko CO Wax | 1492. | Vekiari, Orepoulou, et al., 2010 | 60. m/0.32 mm/0.25 μm, Helium; Program: not specified |
Capillary | DB-Wax | 1493. | Canuti, Conversano, et al., 2009 | 30. m/0.25 mm/0.25 μm, Helium; Program: 40 0C (4 min) 2.5 0C/min -> 80 0C 5 0C/min -> 110 0C 10 0C/min -> 220 0C (5 min) |
Capillary | DB-Wax | 1494. | Canuti, Conversano, et al., 2009 | 30. m/0.25 mm/0.25 μm, Helium; Program: not specified |
Capillary | CP-Wax 52 CB | 1485. | Romeo, Verzera, et al., 2009 | 60. m/0.25 mm/0.25 μm, Helium; Program: 45 0C (5 min) 3 0C/min -> 150 0C 10 0C/min -> 240 0C |
Capillary | Supelcowax-10 | 1489. | de Simon, Estruelas, et al., 2009 | 30. m/0.25 mm/0.25 μm, Helium; Program: 45 0C 3 0C/min -> 230 0C (10 min) 10 0C/min -> 270 0C (21 min) |
Capillary | DB-Wax | 1491. | Zhao, Xu, et al., 2009 | 30. m/0.25 mm/0.25 μm, Helium; Program: not specified |
Capillary | PEG 20M | 1489. | Zhang, Zhang, et al., 2008 | 30. m/0.25 mm/0.25 μm, Helium; Program: 40 0C (3 min) 5 0C/min -> 60 0C 6 0C/min -> 130 0C 10 0C/min -> 230 0C |
Capillary | Supelcowax-10 | 1492. | Berard, Bianchi, et al., 2007 | 30. m/0.25 mm/0.25 μm, He; Program: 35C(8min) => 6C/min => 60C => 4C/min => 160C => 20C/min => 200C(1min) |
Capillary | Supelcowax-10 | 1492. | Berard, Bianchi, et al., 2007 | 30. m/0.25 mm/0.25 μm, He; Program: 35C(8min) => 6C/min => 60C => 4C/min => 160C => 20C/min => 200C(1min) |
Capillary | BP-20 | 1489. | Pontes, Marques, et al., 2007 | 30. m/0.25 mm/0.25 μm, He; Program: 50C(1min) => 2.5C/min => 100C => 2C/min => 180C => 15C/min => 220C |
Capillary | DB-Wax | 1486. | Tian, Zhang, et al., 2007 | 30. m/0.25 mm/0.25 μm, He; Program: 50 0C (2 min) 6 0C/min -> 150 0C 8 0C/min -> 230 0C (15 min) |
Capillary | Supelcowax-10 | 1495. | Vichi, Guadayol, et al., 2007 | 30. m/0.25 mm/0.25 μm, He; Program: 40C(3min) => 4C/min => 75C => 8C/min => 250C(5min) |
Capillary | HP-Innowax | 1494. | Viegas and Bassoli, 2007 | 60. m/0.32 mm/0.25 μm, Helium; Program: 40 0C (5 min) 4 0C/min -> 60 0C (5 min) 8 0C/min -> 250 0C (3 min) |
Capillary | HP-Innowax | 1493. | Viegas and Bassoli, 2007 | 60. m/0.32 mm/0.25 μm, Helium; Program: not specified |
Capillary | PEG-20M | 1489. | Zhang C., Zhang H., et al., 2007 | 30. m/0.25 mm/0.25 μm; Program: 40C(3min) => 5C/min => 60C => 6C/min => 130C => 10C/min => 230C (10min) |
Capillary | Innowax FSC | 1496. | Baser K.H.C., Ozek G., et al., 2006 | 60. m/0.25 mm/0.25 μm, He; Program: 60C(10min) => 4C/min => 220C (10min) => 1C/min => 240C |
Capillary | Innowax FSC | 1496. | Baser, Özek, et al., 2004 | 60. m/0.25 mm/0.25 μm, He; Program: 60C(10min) => 4C/min => 220C(10min) => 1C/min => 240C |
Capillary | HP Innowax FSP | 1496. | Tasdemir, Demirci, et al., 2003 | 60. m/0.25 mm/0.25 μm, He; Program: 60C(10min) => 4C/min => 220C (10min) => 1C/min => 240C |
Capillary | HP Innowax FSP | 1496. | Tasdemir, Demirci, et al., 2003 | 60. m/0.25 mm/0.25 μm, He; Program: 60C(10min) => 4C/min => 220C (10min) => 1C/min => 240C |
Capillary | Innowax | 1496. | Tunaher, Kirimer, et al., 2003 | 60. m/0.25 mm/0.25 μm, He; Program: 60C(10min) => 4C/min => 220C(10min) => 1C/min => 240C (20min) |
Capillary | Nukol | 1480. | López and Dufour, 2001 | N2; Column length: 25. m; Column diameter: 0.25 mm; Program: 45C(5min) => 20C/min => 100C(1min) => 3C/min => 190C(40min) |
Capillary | Innowax | 1495. | Baser, Kürkcüoglu, et al., 1998 | 60. m/0.25 mm/0.25 μm; Program: 60C(10min) => 4C/min => 220C(10min) => 1C/min => 240C |
Capillary | DB-Wax | 1518. | Ziegleder, 1998 | He; Column length: 60. m; Column diameter: 0.25 mm; Program: 45C(4min) => 30C/min => 60C (5min) => 3C/min => 220C(40min) |
Capillary | Supelcowax 10 | 1476. | Castioni and Kapetanidis, 1996 | 60. m/0.25 mm/0.25 μm, Helium; Program: 60 0C (10 min) 2 0C/min -> 80 0C 3 0C/min -> 100 0C 4 0C/min -> 220 0C (30 min) |
Capillary | Supelcowax 10 | 1481. | Castioni and Kapetanidis, 1996 | 60. m/0.25 mm/0.25 μm, Helium; Program: not specified |
Capillary | Supelcowax 10 | 1482. | Castioni and Kapetanidis, 1996 | 60. m/0.25 mm/0.25 μm, Helium; Program: not specified |
Capillary | CP-Wax 52CB | 1470. | Luning, de Rijk, et al., 1994 | 50. m/0.32 mm/1.5 μm; Program: 40C => 2C/min => 150C => 10C/min => 250C |
Capillary | DB-Wax | 1492. | Mattheis, Buchanan, et al., 1992 | 60. m/0.25 mm/0.25 μm, He; Program: 35C (5min) => 2C/min => 50C => 5C/min => 200C(5min) |
Capillary | Carbowax 20M | 1465. | Ramsey and Flanagan, 1982 | Program: not specified |

Lee's RI, non-polar column, custom temperature program

Column type | Active phase | I | Reference | Comment |
---|---|---|---|---|
Capillary | DB-5 | 164.4 | Fuentes, Font, et al., 2007 | Column length: 60. m; Program: not specified |

References

Tjebbes, 1960
Tjebbes, J.,
Heats of combustion of butannal and some related compounds,
Acta Chem. Scand., 1960, 14, 180-188. [all data]
Busygina, Maslova, et al., 1987
Busygina, G.I.; Maslova, V.A.; Shvetsova, K.G.; Babinkov, A.G.; Rabinovich, I.B.; Karyakin, N.V.,
Specific heat and thermodynamic functions of phthalic anhydride and 2-ethylhexanol at 13-350 K,
Zhur. Fiz. Khim., 1987, 61, 2347-2351. [all data]
Gude and Teja, 1995
Gude, M.; Teja, A.S.,
Vapor-Liquid Critical Properties of Elements and Compounds. 4. Aliphatic Alkanols,
J. Chem. Eng. Data, 1995, 40, 1025-1036. [all data]
Ambrose and Ghiassee, 1990
Ambrose, D.; Ghiassee, N.B.,
Vapor pressures, critical temperatures, and critical pressures of benzyl alcohol, octan-2-ol, and 2-ethylhexan-1-ol,
J. Chem. Thermodyn., 1990, 22, 307-11. [all data]
Lawrenson and Lee, 1978
Lawrenson, I.J.; Lee, D.A.,
Thermodynamic properties of organic oxygen compounds XLVIII. The critical temperature of some alkanols,
J. Chem. Thermodyn., 1978, 10, 1111. [all data]
Roganov, Pisarev, et al., 2005
Roganov, Gennady N.; Pisarev, Pavel N.; Emel'yanenko, Vladimir N.; Verevkin, Sergey P.,
Measurement and Prediction of Thermochemical Properties. Improved Benson-Type Increments for the Estimation of Enthalpies of Vaporization and Standard Enthalpies of Formation of Aliphatic Alcohols,
J. Chem. Eng. Data, 2005, 50, 4, 1114-1124, https://doi.org/10.1021/je049561m
. [all data]
Stephenson and Malanowski, 1987
Stephenson, Richard M.; Malanowski, Stanislaw,
Handbook of the Thermodynamics of Organic Compounds, 1987, https://doi.org/10.1007/978-94-009-3173-2
. [all data]
Dykvy, Seprakova, et al., 1961
Dykvy, J.; Seprakova, M.; Paulech, J.,
Chem. Zvesti, 1961, 15, 465. [all data]
Linek and Wichterle, 1973
Linek, J.; Wichterle, I.,
Liquid-vapour equilibrium. LIX. The systems diisopropyl ether-acrylic acid, isopropyl acetate-acrylic acid, acrylic acid-2-ethylhexanol and methyl isobutyl ketone-acrylic acid,
Collect. Czech. Chem. Commun., 1973, 38, 7, 1846-1852, https://doi.org/10.1135/cccc19731846
. [all data]
Dykyj, Seprakova, et al., 1961
Dykyj, J.; Seprakova, M.; Paulech, J.,
Vapor Pressure of Two Alcohols C8 and Two Aldehydes C8,
Chem. Zvesti, 1961, 465-468. [all data]
Bogoslovsky, Anvaer, et al., 1978
Bogoslovsky, Yu.N.; Anvaer, B.I.; Vigdergauz, M.S.,
Chromatographic constants in gas chromatography (in Russian), Standards Publ. House, Moscow, 1978, 192. [all data]
Pías and Gascó, 1975
Pías, J.B.; Gascó, L.,
GC Retention Data of Alcohols and Benzoyl Derivatives of Alcohols,
J. Chromatogr. - Chrom. Data, 1975, d14-d16. [all data]
Wehrli and Kováts, 1959
Wehrli, A.; Kováts, E.,
Gas-chromatographische Charakterisierung ogranischer Verbindungen. Teil 3: Berechnung der Retentionsindices aliphatischer, alicyclischer und aromatischer Verbindungen,
Helv. Chim. Acta, 1959, 7, 7, 2709-2736, https://doi.org/10.1002/hlca.19590420745
. [all data]
Cho, Namgung, et al., 2008
Cho, I.H.; Namgung, H.-J.; Choi, H.-K.; Kim, Y.-S.,
Volatiles and key odorants in the pileus and stipe of pine-mushroom (Tricholoma matsutake Sing.),
Food Chem., 2008, 106, 1, 71-76, https://doi.org/10.1016/j.foodchem.2007.05.047
. [all data]
Cho I.H., Lee S.M., et al., 2007
Cho I.H.; Lee S.M.; Kim S.Y.; Choi H.K.; Kim K.O.; Kim Y.S.,
Differentiation of aroma characteristics of pine-mushrooms (Tricholoma matsutake Sing.) of different grades using gas chromatography-olfactometry and sensory analysis,
J. Agric. Food Chem., 2007, 55, 6, 2323-2328, https://doi.org/10.1021/jf062702z
. [all data]
Engel and Ratel, 2007
Engel, E.; Ratel, J.,
Correction of the data generated by mass spectrometry analyses of biological tissues: Application to food authentication,
J. Chromatogr. A, 2007, 1154, 1-2, 331-341, https://doi.org/10.1016/j.chroma.2007.02.012
. [all data]
Pang T., Zhu S., et al., 2007
Pang T.; Zhu S.; Lu X.; Xu G.,
Identification of unknown compounds on the basis of retention index data in comprehensive two-dimensional gas chromatography,
J. Sep. Sci., 2007, 30, 6, 868-874, https://doi.org/10.1002/jssc.200600471
. [all data]
Zeng, Zhao, et al., 2007
Zeng, Y.-X.; Zhao, C.-X.; Liang, Y.-Z.; Yang, H.; Fang, H.-Z.; Yi, L.-Z.; Zeng, Z.-D.,
Comparative analysis of volatile components from Clematis species growing in China,
Anal. Chim. Acta., 2007, 595, 1-2, 328-339, https://doi.org/10.1016/j.aca.2006.12.022
. [all data]
Cho, Kim, et al., 2006
Cho, I.H.; Kim, S.Y.; Choi, H.-K.; Kim, Y.-S.,
Characterization of Aroma-Active Compounds in Raw and Cooked Pine-Mushrooms (Tricholoma matsutake Sing.),
J. Agric. Food Chem., 2006, 54, 17, 6332-6335, https://doi.org/10.1021/jf060824l
. [all data]
Kallio, Jussila, et al., 2006
Kallio, M.; Jussila, M.; Rissanen, T.; Anttila, P.; Hartonen, K.; Reissell, A.; Vreuls, R.; Adahchour, M.; Hyotylainen, T.,
Comprehensive two-dimensional gas chromatography coupled to time-of-flight mass spectrometry in the identification of organic compounds in atmospheric aerosols from coniferous forest,
J. Chromatogr. A, 2006, 1125, 2, 234-243, https://doi.org/10.1016/j.chroma.2006.05.050
. [all data]
Zhao C.X., Li, et al., 2006
Zhao C.X.; Li, X.N.; Liang Y.Z.; Fang H.Z.; Huang L.F.; Guo F.Q.,
Comparative analysis of chemical components of essential oils from different samples of Rhododendron with the help of chemometrics methods,
Chemom. Intell. Lab. Syst., 2006, 82, 1-2, 218-228, https://doi.org/10.1016/j.chemolab.2005.08.008
. [all data]
Ádámová, Orinák, et al., 2005
Ádámová, M.; Orinák, A.; Halás, L.,
Retention indices as identification tool in pyrolysis-capillary gas chromatography,
J. Chromatogr. A, 2005, 1087, 1-2, 131-141, https://doi.org/10.1016/j.chroma.2005.01.003
. [all data]
Dickschat, Wenzel, et al., 2004
Dickschat, J.S.; Wenzel, S.C.; Bode, H.B.; Muller, R.; Schulz, S.,
Biosynthesis of Volatiles by the Myxobacterium Myxococcus xanthus,
ChemBioChem, 2004, 5, 6, 778-787, https://doi.org/10.1002/cbic.200300813
. [all data]
Hierro, de la Hoz, et al., 2004
Hierro, E.; de la Hoz, L.; Ordóñez, J.A.,
Headspace volatile compounds from salted and occasionally smoked dried meats (cecinas) as affected by animal species,
Food Chem., 2004, 85, 4, 649-657, https://doi.org/10.1016/j.foodchem.2003.07.001
. [all data]
de Lacy Costello, Evans, et al., 2001
de Lacy Costello, B.P.J.; Evans, P.; Ewen, R.J.; Gunson, H.E.; Jones, P.R.H.; Ratcliffe, N.M.; Spencer-Phillips, P.T.N.,
Gas chromatography-mass spectrometry analyses of volatile organic compounds from potato tubers inoculated with Phytophthora infestans or Fusarium coeruleum,
Plant Pathol., 2001, 50, 4, 489-496, https://doi.org/10.1046/j.1365-3059.2001.00594.x
. [all data]
Pino and Marbot, 2001
Pino, J.A.; Marbot, R.,
Volatile flavor constituents of acerola (Malpighia emarginata DC.) fruit,
J. Agric. Food Chem., 2001, 49, 12, 5880-5882, https://doi.org/10.1021/jf010270g
. [all data]
Aaslyng, Elmore, et al., 1998
Aaslyng, M.D.; Elmore, J.S.; Mottram, D.S.,
Comparison of the aroma characteristics of acid-hydrolyzed and enzyme-hydrolyzed vegetable proteins produced from soy,
J. Agric. Food Chem., 1998, 46, 12, 5225-5231, https://doi.org/10.1021/jf9806816
. [all data]
Madruga and Mottram, 1998
Madruga, M.S.; Mottram, D.S.,
The effect of pH on the formation of volatile compounds produced by heating a model system containing 5'-imp and cysteine,
J. Braz. Chem. Soc., 1998, 9, 3, 261-271, https://doi.org/10.1590/S0103-50531998000300010
. [all data]
Moio L., Rillo L., et al., 1996
Moio L.; Rillo L.; Ledda A.; Addeo F.,
Odorous constituents of ovine milk in relationship to diet,
J. Dairy Sci., 1996, 79, 8, 1322-1331, https://doi.org/10.3168/jds.S0022-0302(96)76488-3
. [all data]
Coen, Engel, et al., 1995
Coen, M.; Engel, R.; Nahrstedt, A.,
Chavicol β-D-glucoside, a phenylpropanoid heteroside, benzyl-β-D-glucoside and glycosidically bound volatiles from subspecies of Cedronella canariensis,
Phytochemistry, 1995, 40, 1, 149-155, https://doi.org/10.1016/0031-9422(95)00241-X
. [all data]
Gómez, Ledbetter, et al., 1993
Gómez, E.; Ledbetter, C.A.; Hartsell, P.L.,
Volatile compounds in apricot, plum, and their interspecific hybrids,
J. Agric. Food Chem., 1993, 41, 10, 1669-1676, https://doi.org/10.1021/jf00034a029
. [all data]
Sampaio and Nogueira, 2006
Sampaio, T.S.; Nogueira, P.C.L.,
Volatile components of mangaba fruit (Hancornia speciosa Gomes) at three stages of maturity,
Food Chem., 2006, 95, 4, 606-610, https://doi.org/10.1016/j.foodchem.2005.01.038
. [all data]
Selli, Rannou, et al., 2006
Selli, S.; Rannou, C.; Prost, C.; Robin, J.; Serot, T.,
Characterization of Aroma-Active Compounds in Rainbow Trout (Oncorhynchus mykiss) Eliciting an Off-Odor,
J. Agric. Food Chem., 2006, 54, 25, 9496-9502, https://doi.org/10.1021/jf0619582
. [all data]
Varlet V., Knockaert C., et al., 2006
Varlet V.; Knockaert C.; Prost C.; Serot T.,
Comparison of odor-active volatile compounds of fresh and smoked salmon,
J. Agric. Food Chem., 2006, 54, 9, 3391-3401, https://doi.org/10.1021/jf053001p
. [all data]
Boué, Shih, et al., 2003
Boué, S.M.; Shih, B.Y.; Carter-Wientjes, C.H.; Cleveland, T.E.,
Identification of volatile compounds in soybean at various developmental stages using solid phase microextraction,
J. Agric. Food Chem., 2003, 51, 17, 4873-4876, https://doi.org/10.1021/jf030051q
. [all data]
Oruna-Concha, Bakker, et al., 2002
Oruna-Concha, M.J.; Bakker, J.; Ames, J.M.,
Comparison of the volatile components of two cultivars of potato cooked by boiling, conventional baking and microwave baking,
J. Sci. Food Agric., 2002, 82, 9, 1080-1087, https://doi.org/10.1002/jsfa.1148
. [all data]
Sartin, Halsall, et al., 2001
Sartin, J.H.; Halsall, C.J.; Davison, B.; Owen, S.; Hewitt, C.N.,
Determination of biogenic volatile organic compounds (C8-C16) in the coastal atmosphere at Mace Head, Ireland,
Anal. Chim. Acta., 2001, 428, 1, 61-72, https://doi.org/10.1016/S0003-2670(00)01214-9
. [all data]
Parker, Hassell, et al., 2000
Parker, J.K.; Hassell, G.M.E.; Mottram, D.S.; Guy, R.C.E.,
Sensory and instrumental analyses of volatiles generated during the extrusion cooking of oat flours,
J. Agric. Food Chem., 2000, 48, 8, 3497-3506, https://doi.org/10.1021/jf991302r
. [all data]
Mattinen, Tuominen, et al., 1995
Mattinen, M.-L.; Tuominen, J.; Saarela, K.,
Analysis of TVOC and certain selected compounds from indoor air using GC/FID-RIM technique,
Indoor Air, 1995, 5, 1, 56-61, https://doi.org/10.1111/j.1600-0668.1995.t01-1-00009.x
. [all data]
Peng, Ding, et al., 1988
Peng, C.T.; Ding, S.F.; Hua, R.L.; Yang, Z.C.,
Prediction of Retention Indexes I. Structure-Retention Index Relationship on Apolar Columns,
J. Chromatogr., 1988, 436, 137-172, https://doi.org/10.1016/S0021-9673(00)94575-8
. [all data]
Mahattanatawee K., Perez-Cacho P.R., et al., 2007
Mahattanatawee K.; Perez-Cacho P.R.; Davenport T.; Rouseff R.,
Comparison of three lychee cultivar odor profiles using gas chromatography-olfactometry and gas chromatography-sulfur detection,
J. Agric. Food Chem., 2007, 55, 5, 1939-1944, https://doi.org/10.1021/jf062925p
. [all data]
Pozo-Bayon M.A., Ruiz-Rodriguez A., et al., 2007
Pozo-Bayon M.A.; Ruiz-Rodriguez A.; Pernin K.; Cayot N.,
Influence of eggs on the aroma composition of a sponge cake and on the aroma release in model studies on flavored sponge cakes,
J. Agric. Food Chem., 2007, 55, 4, 1418-1426, https://doi.org/10.1021/jf062203y
. [all data]
Fernandez-Segovia, Escriche, et al., 2006
Fernandez-Segovia, I.; Escriche, I.; Gomez-Sintes, M.; Fuentes, A.; Serra, J.A.,
In?uence of di?erent preservation treatments on the volatile fraction of desalted cod,
Food Chem., 2006, 98, 3, 473-482, https://doi.org/10.1016/j.foodchem.2005.06.021
. [all data]
Pinto, Guedes, et al., 2006
Pinto, A.B.; Guedes, C.M.; Moreira, R.F.A.; de Maria, C.A.B.,
Volatile constituents from headspace and aqueous solution of genipap (Genipa americana) fruit isolated by the solid-phase extraction method,
Flavour Fragr. J., 2006, 21, 3, 488-491, https://doi.org/10.1002/ffj.1623
. [all data]
Alasalvar, Taylor, et al., 2005
Alasalvar, C.; Taylor, K.D.A.; Shahidi, F.,
Comparison of volatiles of cultured and wild sea bream (Sparus aurata) during storage in ice by dynamic headspace analysis/gas chromatography-mass spectrometry,
J. Agric. Food Chem., 2005, 53, 7, 2616-2622, https://doi.org/10.1021/jf0483826
. [all data]
Chung, Fung, et al., 2005
Chung, H.Y.; Fung, P.K.; Kim, J.-S.,
Aroma impact components in commercial plain sufu,
J. Agric. Food Chem., 2005, 53, 5, 1684-1691, https://doi.org/10.1021/jf048617d
. [all data]
Cros, Lignot, et al., 2005
Cros, S.; Lignot, B.; Bourseau, P.; Jaouen, P.; Prost, C.,
Desalination of mussel cooking juices by electrodialysis: effect on the aroma profile,
J. Food Eng., 2005, 69, 4, 425-436, https://doi.org/10.1016/j.jfoodeng.2004.08.036
. [all data]
Malliaa, Fernandez-Garcia, et al., 2005
Malliaa, S.; Fernandez-Garcia, E.; Bosset, J.O.,
Comparison of purge and trap and solid phase microextraction techniques for studying the volatile aroma compounds of three European PDO hard cheeses,
Int. Dairy J., 2005, 15, 6-9, 741-758, https://doi.org/10.1016/j.idairyj.2004.11.007
. [all data]
Ledauphin, Saint-Clair, et al., 2004
Ledauphin, J.; Saint-Clair, J.-F.; Lablanquie, O.; Guichard, H.; Founier, N.; Guichard, E.; Barillier, D.,
Identification of trace volatile compounds in freshly distilled calvados and cognac using preparative separations coupled with gas chromatography-mass spectrometry,
J. Agric. Food Chem., 2004, 52, 16, 5124-5134, https://doi.org/10.1021/jf040052y
. [all data]
Bonvehi and Coll, 2003
Bonvehi, J.S.; Coll, F.V.,
Flavour index and aroma profiles of fresh and processed honeys,
J. Sci. Food Agric., 2003, 83, 4, 275-282, https://doi.org/10.1002/jsfa.1308
. [all data]
Cros, Vandanjon, et al., 2003
Cros, S.; Vandanjon, L.; Jaouen, P.; Bourseau, P.,
Processing of industrial mussel cooking juices by reverse osmosis: pollution abatement and aromas recovery, 2003, retrieved from http://www.membrane.unsw.edu.au/imstec03/content/papers/DAI/imstec064.pdf. [all data]
Brunton, Cronin, et al., 2002
Brunton, N.P.; Cronin, D.A.; Monahan, F.J.,
Volatile components associated with freshly cooked and oxidized off-flavours in turkey breast meat,
Flavour Fragr. J., 2002, 17, 5, 327-334, https://doi.org/10.1002/ffj.1087
. [all data]
Chung, Yung, et al., 2002
Chung, H.-Y.; Yung, I.K.S.; Ma, W.C.J.; Kim, J.-S.,
Analysis of volatile components in frozen and dried scallops (Patinopecten yessoensis) by gas chromatography/mass spectrometry,
Food Res. Int., 2002, 35, 1, 43-53, https://doi.org/10.1016/S0963-9969(01)00107-7
. [all data]
Moreira, Trugo, et al., 2002
Moreira, R.F.A.; Trugo, L.C.; Pietroluongo, M.; de Maria, C.A.B.,
Flavor composition of cashew (Anacardium occidentale) and marmeleiro (Croton species) honeys,
J. Agric. Food Chem., 2002, 50, 26, 7616-7621, https://doi.org/10.1021/jf020464b
. [all data]
Chung, Yung, et al., 2001
Chung, H.Y.; Yung, I.K.S.; Kim, J.-S.,
Comparison of volatile components in dried scallops (Chlamys farreri and Patinopecten yessoensis) prepared by boiling and steaming methods,
J. Agric. Food Chem., 2001, 49, 1, 192-202, https://doi.org/10.1021/jf000692a
. [all data]
Shimoda, Yoshimura, et al., 2001
Shimoda, M.; Yoshimura, Y.; Yoshimura, T.; Noda, K.; Osajima, Y.,
Volatile flavor compounds of sweetened condensed milk,
J. Food Sci., 2001, 66, 6, 804-807, https://doi.org/10.1111/j.1365-2621.2001.tb15176.x
. [all data]
Beauchene, Grua-Priol, et al., 2000
Beauchene, D.; Grua-Priol, J.; Lamer, T.; Demaimay, M.; Quemeneur, F.,
Concentration by pervaporation of aroma compounds from Fucus serratus,
J. Sci. Food Agric., 2000, 75, 451-458. [all data]
Chevance, Farmer, et al., 2000
Chevance, F.F.V.; Farmer, L.J.; Desmond, E.M.; Novelli, E.; Troy, D.J.; Chizzolini, R.,
Effect of some fat replacers on the release of volatile aroma compounds from low-fat meat products,
J. Agric. Food Chem., 2000, 48, 8, 3476-3484, https://doi.org/10.1021/jf991211u
. [all data]
Chung, 2000
Chung, H.Y.,
Volatile flavor components in red fermented soybean (Glycine max) curds,
J. Agric. Food Chem., 2000, 48, 5, 1803-1809, https://doi.org/10.1021/jf991272s
. [all data]
Le Guen, Prost, et al., 2000
Le Guen, S.; Prost, C.; Demaimay, M.,
Characterization of odorant compounds of mussels (Mytilus edulis) according to their origin using gas chromatography-olfactometry and gas chromatography-mass spectrometry,
J. Chromatogr. A, 2000, 896, 1-2, 361-371, https://doi.org/10.1016/S0021-9673(00)00729-9
. [all data]
Chevance and Farmer, 1999
Chevance, F.F.V.; Farmer, L.J.,
Identification of major volatile odor compounds in frankfurters,
J. Agric. Food Chem., 1999, 47, 12, 5151-5160, https://doi.org/10.1021/jf990515d
. [all data]
Chung, 1999
Chung, H.Y.,
Volatile components in crabmeats of Charybdis feriatus,
J. Agric. Food Chem., 1999, 47, 6, 2280-2287, https://doi.org/10.1021/jf981027t
. [all data]
Shimoda, Peralta, et al., 1996
Shimoda, M.; Peralta, R.R.; Osajima, Y.,
Headspace gas analysis of fish sauce,
J. Agric. Food Chem., 1996, 44, 11, 3601-3605, https://doi.org/10.1021/jf960345u
. [all data]
Shimoda, Wu, et al., 1996
Shimoda, M.; Wu, Y.; Osajima, Y.,
Aroma compounds from aqueous solution of Haze (Rhus succedanea) honey determined by adsorptive column chromatography,
J. Agric. Food Chem., 1996, 44, 12, 3913-3918, https://doi.org/10.1021/jf9601168
. [all data]
Shimoda, Shigematsu, et al., 1995
Shimoda, M.; Shigematsu, H.; Shiratsuchi, H.; Osajima, Y.,
Comparison of the odor concentrates by SDE and adsorptive column method from green tea infusion,
J. Agric. Food Chem., 1995, 43, 6, 1616-1620, https://doi.org/10.1021/jf00054a037
. [all data]
Shiratsuchi, Shimoda, et al., 1994
Shiratsuchi, H.; Shimoda, M.; Imayoshi, K.; Noda, K.; Osajima, Y.,
Off-flavor compounds in spray-dried skim milk powder,
J. Agric. Food Chem., 1994, 42, 6, 1323-1327, https://doi.org/10.1021/jf00042a014
. [all data]
Shiratsuchi, Shimoda, et al., 1994, 2
Shiratsuchi, H.; Shimoda, M.; Imayoshi, K.; Noda, K.; Osajima, Y.,
Volatile flavor compounds in spray-dried skim milk powder,
J. Agric. Food Chem., 1994, 42, 4, 984-988, https://doi.org/10.1021/jf00040a028
. [all data]
Sumitani, Suekane, et al., 1994
Sumitani, H.; Suekane, S.; Nakatani, A.; Tatsuka, K.,
Changes in composition of volatile compounds in high pressure treated peach,
J. Agric. Food Chem., 1994, 42, 3, 785-790, https://doi.org/10.1021/jf00039a037
. [all data]
Chung and Cadwallader, 1993
Chung, H.Y.; Cadwallader, K.R.,
Volatile components in blue crab (Callinectes sapidus) meat and processing by-product,
J. Food Sci., 1993, 58, 6, 1203-1207, https://doi.org/10.1111/j.1365-2621.1993.tb06148.x
. [all data]
Umano, Hagi, et al., 1992
Umano, K.; Hagi, Y.; Nakahara, K.; Shoji, A.; Shibamoto, T.,
Volatile constituents of green and ripened pineapple (Aanas comosus [L.] Merr.),
J. Agric. Food Chem., 1992, 40, 4, 599-603, https://doi.org/10.1021/jf00016a014
. [all data]
Wu and Liou, 1992
Wu, C.-M.; Liou, S.-E.,
Volatile components of water-boiled duck meat and Cantonese style roasted duck,
J. Agric. Food Chem., 1992, 40, 5, 838-841, https://doi.org/10.1021/jf00017a026
. [all data]
Salter L.J., Mottram D.S., et al., 1988
Salter L.J.; Mottram D.S.; Whitfield,
Volatile compounds produces in Maillard reactions involving glycine, ribose and phospholid,
J. Sci. Food Agric., 1988, 46, 2, 227-242, https://doi.org/10.1002/jsfa.2740460211
. [all data]
Bianchi, Careri, et al., 2007
Bianchi, F.; Careri, M.; Mangia, A.; Musci, M.,
Retention indices in the analysis of food aroma volatile compounds in temperature-programmed gas chromatography: Database creation and evaluation of precision and robustness,
J. Sep. Sci., 2007, 39, 4, 563-572, https://doi.org/10.1002/jssc.200600393
. [all data]
Romeo, Ziino, et al., 2007
Romeo, V.; Ziino, M.; Giuffrrida, D.; Condurso, C.; Verzera, A.,
Flavour profile of capers (Capparis spinosa L.) from the Eolian Archipelago by HS-SPME/GC?MS,
Food Chem., 2007, 101, 3, 1272-1278, https://doi.org/10.1016/j.foodchem.2005.12.029
. [all data]
Guillot, Peytavi, et al., 2006
Guillot, S.; Peytavi, L.; Bureau, S.; Boulanger, R.; Lepoutre, J.-P.; Crouzet, J.; Schorr-Galindo, S.,
Aroma characterization of various apricot varieties using headspace-solid phase microextraction combined with gas chromatography-mass spectrometry and gas chromatography-olfactometry,
Food Chem., 2006, 96, 1, 147-155, https://doi.org/10.1016/j.foodchem.2005.04.016
. [all data]
Aubert, Baumann, et al., 2005
Aubert, C.; Baumann, S.; Arguel, H.,
Optimization of the Analysis of Flavor Volatile Compounds by Liquid-Liquid Microextraction (LLME). Application to the Aroma Analysis of Melons, Peaches, Grapes, Strawberries, and Tomatoes,
J. Agric. Food Chem., 2005, 53, 23, 8881-8895, https://doi.org/10.1021/jf0510541
. [all data]
Hallier, Prost, et al., 2005
Hallier, A.; Prost, C.; Serot, T.,
Influence in rearing conditions on the volatile compounds of cooked fillets of Silurus glanis (European catfish),
J. Agric. Food Chem., 2005, 53, 18, 7204-7211, https://doi.org/10.1021/jf050559o
. [all data]
Ranau and Steinhart, 2005
Ranau, R.; Steinhart, H.,
Identification and evaluation of volatile odor-active pollutants from different odor emission sources in the food industry,
Eur. Food Res. Technol., 2005, 220, 2, 226-231, https://doi.org/10.1007/s00217-004-1073-4
. [all data]
Verzera, Ziino, et al., 2004
Verzera, A.; Ziino, M.; Condurso, C.; Romeo, V.; Zappala, M.,
Solid-phase microextraction and gas chromatography-mass spectrometry for rapid characterisation of semi-hard cheeses,
Anal. Bioanal. Chem., 2004, 380, 7-8, 930-936, https://doi.org/10.1007/s00216-004-2879-4
. [all data]
Pennarun, Prost, et al., 2003
Pennarun, A.-L.; Prost, C.; Haure, J.; Demaimay, M.,
Comparison of two microalgal diets. 2. Influence on odorant composition and organoleptic qualities of raw oysters (Crassostrea gigas),
J. Agric. Food Chem., 2003, 51, 7, 2011-2018, https://doi.org/10.1021/jf020549c
. [all data]
Pennarun, Prost, et al., 2002
Pennarun, A.L.; Prost, C.; Demaimay, M.,
Identification and origin of the character-impact compounds of raw oyster Crassostrea gigas,
J. Sci. Food Agric., 2002, 82, 14, 1652-1660, https://doi.org/10.1002/jsfa.1236
. [all data]
Cantergiani, Brevard, et al., 2001
Cantergiani, E.; Brevard, H.; Krebs, Y.; Feria-Morales, A.; Amadò, R.; Yeretzian, C.,
Characterisation of the aroma of green Mexican coffee and identification of mouldy/earthy defect,
Eur. Food Res. Technol., 2001, 212, 6, 648-657, https://doi.org/10.1007/s002170100305
. [all data]
Larráyoz, Addis, et al., 2001
Larráyoz, P.; Addis, M.; Gauch, R.; Bosset, J.O.,
Comparison of dynamic headspace and simultaneous distillation extraction techniques used for the analysis of the volatile components in three European PDO ewes milk cheeses,
Int. Dairy J., 2001, 11, 11-12, 911-926, https://doi.org/10.1016/S0958-6946(01)00144-3
. [all data]
Ziegleder, 2001
Ziegleder, G.,
Odorous compounds in paperboard as influenced by recycled material and storage,
Packag. Technol. Sci., 2001, 14, 4, 131-136, https://doi.org/10.1002/pts.541
. [all data]
Baek and Cadwallader, 1996
Baek, H.H.; Cadwallader, K.R.,
Volatile compounds in flavor concentrates produced from crayfish-processing byproducts with and without protease treatment,
J. Agric. Food Chem., 1996, 44, 10, 3262-3267, https://doi.org/10.1021/jf960023q
. [all data]
Whitfield, Shea, et al., 1981
Whitfield, F.B.; Shea, S.R.; Gillen, K.J.; Shaw, K.J.,
Volatile components from the roots of Acacia pulchella R.Br. and their effect on Phytophthora cinnamomi rands,
Aust. J. Bot., 1981, 29, 2, 195-208, https://doi.org/10.1071/BT9810195
. [all data]
Zhou and Wu, 2007
Zhou, L.; Wu, Q.,
Model of artificial neural network for quantitative structure-retention relations of saturated alcohols,
J. Southwest Univ. (Nat. Sci. Edn.), 2007, 33, 6, 1369-1372. [all data]
Anderson, 1968
Anderson, D.G.,
USe of Kovats retention indices and response factors for the qualitative and quantitative analysis of coating solvents,
J. Paint Technol., 1968, 40, 527, 549-557. [all data]
Wanakhachornkrai and Lertsiri, 9999
Wanakhachornkrai, P.; Lertsiri, S.,
Comparison of determination method for volatile compounds in Thai soy sauce,
Analytical, Nutritional and Clinical Methods, 9999, 1-11. [all data]
Goeminne, Vandendriessche, et al., 2012
Goeminne, P.C.; Vandendriessche, T.; Van Eldere, J.; Nicolai, B.M.; Hertog, M.L.; Dupont, L.J.,
Detection of Pseudomonas aeruginosa in sputum headspace through volatile organic compound analysis,
Respiratory Res., 2012, 13, 87, 1-9. [all data]
Leffingwell and Alford, 2011
Leffingwell, J.; Alford, E.D.,
Volatile constituents of the giant pufball mushroom (Calvatia gigantea),
Leffingwell Rep., 2011, 4, 1-17. [all data]
Liu, Lu, et al., 2011
Liu, S.; Lu, S.; Su, Y.; Guo, Y.,
Analysis of volatile compounds in Radix Bupleuri injection by GC-MS-MS,
Chromatographia, 2011, 74, 5-6, 497-502, https://doi.org/10.1007/s10337-011-2082-7
. [all data]
Miyazawa, Marumoto, et al., 2011
Miyazawa, M.; Marumoto, S.; Kobayashi, T.; Yoshida, S.; Utsumi, Y.,
Determination of characteristic components in essential oils from Wisteria braphybotrys using gas chromatography - olfactometry incremental dilution technique,
Rec. Nat. Prod., 2011, 5, 3, 221-227. [all data]
Hu, Liang, et al., 2010
Hu, C.-D.; Liang, Y.-Z.; Guo, F.-Q.; Li, X.-R.; Wang, W.-P.,
Determination of essential oil composition from Osmanthus fragrans tea by GC-MS combined with a chemometric resolution method,
Molecules, 2010, 15, 5, 3683-3693, https://doi.org/10.3390/molecules15053683
. [all data]
Jerkovic and Marijanovic, 2010
Jerkovic, I.; Marijanovic, Z.,
Oak (Quercus frainetto Ten.) honeydaw honey - approach to screening of volatile organic composition and antioxidant capacity (DPPH and FRAP assay),
Molecules, 2010, 15, 5, 3744-3756, https://doi.org/10.3390/molecules15053744
. [all data]
Radulovic, Blagojevic, et al., 2010
Radulovic, N.; Blagojevic, P.; Palic, R.,
Comparative study of the leaf volatiles of Arctostaphylos uva-ursi (L.) Spreng. and Vaccinium vitis-idaea L. (Ericaceae),
Molecules, 2010, 15, 9, 6168-6185, https://doi.org/10.3390/molecules15096168
. [all data]
Radulovic, Dordevic, et al., 2010
Radulovic, N.; Dordevic, N.; Markovic, M.; Palic, R.,
Volatile constituents of Glechoma Hirsuta Waldst. Kit. and G. Hederacea L. (Lamiaceae),
Bull. Chem. Soc. Ethiop., 2010, 24, 1, 67-76, https://doi.org/10.4314/bcse.v24i1.52962
. [all data]
Silva, Pott, et al., 2010
Silva, D.B.; Pott, A.; Oliveira, D.C.R.,
Analyses of the headspace volatile constituents of aerial parts (leaves and stems), flowers and fruits of Bidens gardneri Bak. and Bidens sulphurea (Cav.) Sch. Bip. using solid-phase microextraction,
J. Essen. Oil Res., 2010, 22, 6, 560-563, https://doi.org/10.1080/10412905.2010.9700400
. [all data]
Li and Zhao, 2009
Li, L.; Zhao, J.,
Determination of the volatile composition of Rhodobryum giganteum (Schwaegr.) Par. (Bryaceae) using solid-phase microextraction and gas chromatography / mass spectrometry (GC/MS),
Molecules, 2009, 14, 6, 2195-2201, https://doi.org/10.3390/molecules14062195
. [all data]
Romeo, Verzera, et al., 2009
Romeo, V.; Verzera, A.; Ziino, M.; Condurao, C.; Tripodi, G.,
Headspace volatiles of Vicia sativa L. (Legumnodeae) by solid-phase microextraction and gas chromatography/mass spectrometry,
J. Ess. Oil Res., 2009, 21, 1, 33-35, https://doi.org/10.1080/10412905.2009.9700101
. [all data]
Forero, Quijano, et al., 2008
Forero, M.D.; Quijano, C.E.; Pino, J.A.,
Volatile compounds of Chile pepper (Capsicum annuum L. var. glabriusculum) at two ripening stages,
Flavour Fragr. J., 2008, 24, 1, 25-30, https://doi.org/10.1002/ffj.1913
. [all data]
Pham, Schilling, et al., 2008
Pham, A.J.; Schilling, M.W.; Yoon, Y.; Kamadia, V.V.; Marshall, D.L.,
Characterization of fish sauce aroma-impact compounds using GC-MS, SPME-Osme-GCO, and Stevens' power law exponents,
J. Food. Sci., 2008, 73, 4, c268-c274, https://doi.org/10.1111/j.1750-3841.2008.00709.x
. [all data]
Gogus, Ozel, et al., 2007
Gogus, F.; Ozel, M.Z.; Lewis, A.C.,
The Effect of Various Drying Techniques on Apricot Volatiles Analysed Using Direct Desorption-GC-TOF/MS,
Talanta, 2007, 73, 2, 321-325, https://doi.org/10.1016/j.talanta.2007.03.048
. [all data]
Setkova, Risticevic, et al., 2007
Setkova, L.; Risticevic, S.; Pawliszyn, J.,
Rapid headspace solid-phase microextraction-gas chromatographic?time-of-flight mass spectrometric method for qualitative profiling of ice wine volatile fraction II: Classification of Canadian and Czech ice wines using statistical evaluation of the data,
J. Chromatogr. A, 2007, 1147, 2, 224-240, https://doi.org/10.1016/j.chroma.2007.02.052
. [all data]
Vasta, Ratel, et al., 2007
Vasta, V.; Ratel, J.; Engel, E.,
Mass Spectrometry Analysis of Volatile Compounds in Raw Meat for the Authentication of the Feeding Background of Farm Animals,
J. Agric. Food Chem., 2007, 55, 12, 4630-4639, https://doi.org/10.1021/jf063432n
. [all data]
Fan and Qian, 2006
Fan, W.; Qian, M.C.,
Identification of aroma compounds in Chinese 'Yanghe Daqu' liquor by normal phase chromatography fractionation followed by gas chromatography/olfactometry,
Flavour Fragr. J., 2006, 21, 2, 333-342, https://doi.org/10.1002/ffj.1621
. [all data]
Morteza-Semnani, Saeedi, et al., 2006
Morteza-Semnani, K.; Saeedi, M.; Akbarsadeh, M.; Moshiri, K.,
The essential oil composition of Onosma microcarpum DC.,
Flavour Fragr. J., 2006, 21, 2, 314-316, https://doi.org/10.1002/ffj.1597
. [all data]
Holland, Larkov, et al., 2005
Holland, D.; Larkov, O.; Bar-Ya'akov, I.; Bar, E.; Zax, A.; Brandeis, E.; Ravid, U.; Lewinsohn, E.,
Developmental and varietal differences in volatile ester formation and acetyl-CoA: alcohol acetyl transferase activities in apple (Malus domestica Borkh.) fruit,
J. Agric. Food Chem., 2005, 53, 18, 7198-7203, https://doi.org/10.1021/jf050519k
. [all data]
Rohloff and Bones, 2005
Rohloff, J.; Bones, A.M.,
Volatile profiling of Arabidopsis thaliana - Putative olfactory compounds in plant communication,
Phytochemistry, 2005, 66, 16, 1941-1955, https://doi.org/10.1016/j.phytochem.2005.06.021
. [all data]
Ramírez, Estévez, et al., 2004
Ramírez, M.R.; Estévez, M.; Morcuende, D.; Cava, R.,
Effect of the type of frying culinary fat on volatile compounds isolated in fried pork loin chops by using SPME-GC-MS,
J. Agric. Food Chem., 2004, 52, 25, 7637-7643, https://doi.org/10.1021/jf049207s
. [all data]
Robledo and Arzuffi, 2004
Robledo, N.; Arzuffi, R.,
Identificacion de los compuestos volatiles de papaya y cuaguayote mediante microextraccion en fase solida, cromatografia de gases y espectrometria de masas,
Rev. Latinoamericana Quim., 2004, 32, 1, 30-36. [all data]
Dhanda, Pegg, et al., 2003
Dhanda, J.S.; Pegg, R.B.; Shand, P.J.,
Saskatchewan specialty livestock value-added program - Saskatchewan agri-food innovation fund (AFIF) Project #98000016, 2003, retrieved from http://www.agr.gov.sk.ca/afif/Projects/19980016.pdf. [all data]
Sebastian, Viallon-Fernandez, et al., 2003
Sebastian, I.; Viallon-Fernandez, C.; Berge, P.; Berdague, J.-L.,
Analysis of the volatile fraction of lamb fat tissue: influence of the type of feeding,
Sciences des Aliments, 2003, 23, 4, 497-511, https://doi.org/10.3166/sda.23.497-511
. [all data]
Wanakhachornkrai and Lertsiri, 2003
Wanakhachornkrai, P.; Lertsiri, S.,
Analytical, nutritional, and clinical methods. Comparison of determination method for volatile compounds in Thai soy sauce,
Food Chem., 2003, 83, 4, 619-629, https://doi.org/10.1016/S0308-8146(03)00256-5
. [all data]
Hayes R.A., Richardson B.J., et al., 2002
Hayes R.A.; Richardson B.J.; Claus S.C.; Wyllie S.G.,
Semiochemicals and social signaling in the wild European rabbit in Australia: II. Variations in chemical composition of chin gland secretion across sampling sites,
J. Chem. Ecol., 2002, 28, 12, 2613-2625, https://doi.org/10.1023/A:1021452623055
. [all data]
García, Martín, et al., 2000
García, C.; Martín, A.; Timón, M.L.; Córdoba, J.J.,
Microbial populations and volatile compounds in the 'bone taint' spoilage of dry cured ham,
Lett. Appl. Microbiol., 2000, 30, 1, 61-66, https://doi.org/10.1046/j.1472-765x.2000.00663.x
. [all data]
Kim, Kim, et al., 2000
Kim, H.-J.; Kim, K.; Kim, N.-S.; Lee, D.-S.,
Determination of floral fragrances of Rosa hybrida using solid-phase trapping-solvent extraction and gas chromatography-mass spectrometry,
J. Chromatogr. A, 2000, 902, 2, 389-404, https://doi.org/10.1016/S0021-9673(00)00863-3
. [all data]
Baraldi, Rapparini, et al., 1999
Baraldi, R.; Rapparini, F.; Rossi, F.; Latella, A.; Ciccioli, P.,
Volatile organic compound emissions from flowers of the most occurring and economically important species of fruit trees,
Phys. Chem. Earth, 1999, 24, 6, 729-732, https://doi.org/10.1016/S1464-1909(99)00073-8
. [all data]
Robacker and Bartelt, 1997
Robacker, D.C.; Bartelt, R.J.,
Chemicals attractive to Mexican fruit fly from Klebsiella pneumoniae and Citrobacter freundii cultures sampled by solid-phase microextraction MICROEXTRACTION,
J. Chem. Ecol., 1997, 23, 12, 2897-2915, https://doi.org/10.1023/A:1022579414233
. [all data]
Huang, Liang, et al., 1996
Huang, C.; Liang, H.; Han, S.,
The analysis of organic compounds in waste water by gas extraction/thermal desorption/gas chromatography-mass spectrometry,
Chin. J. Chromatogr., 1996, 14, 6, 421-424. [all data]
Wong and Lai, 1996
Wong, K.C.; Lai, F.Y.,
Volatile constituents from the fruits of four Syzygium species grown in Malaysia,
Flavour Fragr. J., 1996, 11, 1, 61-66, https://doi.org/10.1002/(SICI)1099-1026(199601)11:1<61::AID-FFJ539>3.0.CO;2-1
. [all data]
King, Matthews, et al., 1995
King, M.-F.; Matthews, M.A.; Rule, D.C.; Field, R.A.,
Effect of beef packaging method on volatile compounds developed by oven roasting or microwave cooking,
J. Agric. Food Chem., 1995, 43, 3, 773-778, https://doi.org/10.1021/jf00051a039
. [all data]
Gomez and Ledbetter, 1994
Gomez, E.; Ledbetter, C.A.,
Comparative study of the aromatic profiles of two different plum species: Prunus salicina Lindl and Prunus simonii L.,
J. Sci. Food Agric., 1994, 65, 1, 111-115, https://doi.org/10.1002/jsfa.2740650116
. [all data]
King, Hamilton, et al., 1993
King, M.-F.; Hamilton, B.L.; Matthews, M.A.; Rule, D.C.; Field, R.A.,
Isolation and identification of volatiles and condensable material in raw beef with supercritical carbon dioxide extraction,
J. Agric. Food Chem., 1993, 41, 11, 1974-1981, https://doi.org/10.1021/jf00035a030
. [all data]
Moio, Dekimpe, et al., 1993
Moio, L.; Dekimpe, J.; Etievant, P.; Addeo, F.,
Neutral volatile compounds in the raw milks from different species,
J. Dairy Res., 1993, 60, 2, 199-213, https://doi.org/10.1017/S0022029900027515
. [all data]
Shiota, 1991
Shiota, H.,
Volatile components of pawpaw fruit (Asimina triloba Dunal.),
J. Agric. Food Chem., 1991, 39, 9, 1631-1635, https://doi.org/10.1021/jf00009a019
. [all data]
Habu, Flath, et al., 1985
Habu, T.; Flath, R.A.; Mon, T.R.; Morton, J.F.,
Volatile components of Rooibos tea (Aspalathus linearis),
J. Agric. Food Chem., 1985, 33, 2, 249-254, https://doi.org/10.1021/jf00062a024
. [all data]
Stern, Flath, et al., 1985
Stern, D.J.; Flath, R.A.; Mon, T.R.; Teranishi, R.; Lundin, R.E.; Benson, M.E.,
Crude oleic acid volatiles,
J. Agric. Food Chem., 1985, 33, 2, 180-184, https://doi.org/10.1021/jf00062a005
. [all data]
Flath, Mon, et al., 1983
Flath, R.A.; Mon, T.R.; Lorenz, G.; Whitten, C.J.; Mackley, J.W.,
Volatile components of Acacia sp. blossoms,
J. Agric. Food Chem., 1983, 31, 6, 1167-1170, https://doi.org/10.1021/jf00120a008
. [all data]
Mondello, 2012
Mondello, L.,
HS-SPME-GCxGC-MS analysis of Yerba Mate (Ilex paraguariensis)
in Shimadzu GC-GC application compendium of comprehensive 2D GC, Vol. 1-5, Shimadzu Corp., 2012, 1-29. [all data]
Robinson, Adams, et al., 2012
Robinson, A.L.; Adams, D.O.; Boss, P.K.; Heymann, H.; Solomon, P.S.; Trengove, R.D.,
Influence of geographic origine on the sensory characteristics and wine composition of Vitus viniferas cv. Cabernet Sauvignon wines from Australia (Supplemental data),
Am. J. Enol. Vitic., 2012, 64, 4, 467-476, https://doi.org/10.5344/ajev.2012.12023
. [all data]
VOC BinBase, 2012
VOC BinBase,
The volatile compound BinBase (VOC BinBase), 2012, retrieved from http://fiehnlab.ucdavis.edu/projects/VocBinBase and http://binbase.sourceforge.net. [all data]
Skogerson, Wohlgemuth, et al., 2011
Skogerson, K.; Wohlgemuth, G.; Fiehn, O.,
VocBinNase, 2011, retrieved from http://fiehnlab.ucdavis.edu/projects//VocBinBase. [all data]
Fan, Lu, et al., 2009
Fan, G.; Lu, W.; Yao, X.; Zhang, Y.; Wang, K.; Pan, S.,
effect of fermentation on free and bound volatile compounds of orange juice,
Flavour Fragr. J., 2009, 24, 5, 219-229, https://doi.org/10.1002/ffj.1931
. [all data]
Ortiz, Echeverra, et al., 2009
Ortiz, A.; Echeverra, G.; Graell, J.; Lara, I.,
Calcium dips enhance volatile emission of cold-stored Fuji Kiki-8 apples,
J. Agric. Food Chem., 2009, 57, 11, 4931-4938, https://doi.org/10.1021/jf9003576
. [all data]
de Simon, Estruelas, et al., 2009
de Simon, B.F.; Estruelas, E.; Munoz, A.M.; Cadahia, E.; Sanz, M.,
Volatile compounds in acacia, chestnut, cherry, ash, and oak woods, with a view to their use in cooperage,
J. Agric. Food Chem., 2009, 57, 8, 3217-3227, https://doi.org/10.1021/jf803463h
. [all data]
Zhang and Liang, 2009
Zhang, L.; Liang, Y.,
Dissimilarity analysis and automatic identification of monomethylalkanes from gas chromatography mass spectrometry data. 1. Principle and protocol,
J. Chromatogr. A, 2009, 1216, 27, 5272-5283, https://doi.org/10.1016/j.chroma.2009.04.089
. [all data]
Watanabe, Ueda, et al., 2008
Watanabe, A.; Ueda, Y.; Higuchi, M.; Shiba, N.,
Analysis of volatile compounds in beef fat by dinamic-headspace solid phase microextraction combined with gas chromatography - mass spectrometry,
J. Food Sci., 2008, 73, 5, 420-425, https://doi.org/10.1111/j.1750-3841.2008.00764.x
. [all data]
Barra, Baldovini, et al., 2007
Barra, A.; Baldovini, N.; Loiseau, A.-M.; Albino, L.; Lesecq, C.; Cuvelier, L.L.,
Chemical analysis of French beans (Phaseolus vulgaris L.) by headspace solid phase microextraction (HS-SPME) and simultaneous distillation/extraction (SDE),
Food Chem., 2007, 101, 3, 1279-1284, https://doi.org/10.1016/j.foodchem.2005.12.027
. [all data]
Chen and Feng, 2007
Chen, Y.; Feng, C.,
QSPR study on gas chromatography retention index of some organic pollutants,
Comput. Appl. Chem. (China), 2007, 24, 10, 1404-1408. [all data]
Dou, Li, et al., 2007
Dou, H.-L.; Li, C.-M.; Gu, H.-F.; Hao, J.-F.,
Comparative analysis on aromatic components of green tea and fresh green tea beverage using HS-SPME/GC-MS/GC-olfactometry/RI methods,
Journal of Tea Science, 2007, 27, 1, 51-60. [all data]
Liu, Xu, et al., 2007
Liu, Y.; Xu, X.-L.; Zhou, G.-H.,
Comparative study of volatile compounds in traditional Chinese Nanjing marinated duck by different extraction techniques,
Int. J. Food Sci. Technol., 2007, 42, 5, 543-550, https://doi.org/10.1111/j.1365-2621.2006.01264.x
. [all data]
Splivallo, Bossi, et al., 2007
Splivallo, R.; Bossi, S.; Maffei, M.; Bonfante, P.,
Discrimination of truffle fruiting body versus mycelial aromas by stir bar sorptive extraction,
Phytochemistry, 2007, 68, 20, 2584-2598, https://doi.org/10.1016/j.phytochem.2007.03.030
. [all data]
Beaulieu J.C. and Lea J.M., 2006
Beaulieu J.C.; Lea J.M.,
Characterization and semiquantitative analysis of volatiles in seedless watermelon varieties using solid-phase microextraction,
J. Agric. Food Chem., 2006, 54, 20, 7789-7793, https://doi.org/10.1021/jf060663l
. [all data]
Kou, Zhang, et al., 2006
Kou, J.; Zhang, S.; Hu, Y.; Qiao, H.; Li, J.,
Stidy on the relationships between structures and gas chromatographic retention indices of alcohols,
Comput. Appl. Chem. (Chinese), 2006, 23, 7, 651-654. [all data]
Blunden, Aneja, et al., 2005
Blunden, J.; Aneja, V.P.; Lonneman, W.A.,
Characterization of non-methane volatile organic compounds at swine facilities in eastern North Carolina,
Atm. Environ., 2005, 39, 36, 6707-6718, https://doi.org/10.1016/j.atmosenv.2005.03.053
. [all data]
Duflos, Moine, et al., 2005
Duflos, G.; Moine, F.; Coin, V.M.; Malle, P.,
Determination of volatile compounds in whiting (Merlangius merlangus) using headspace-solid-phase microextraction-gas chromatography-mass spectrometry,
J. Chromatogr. Sci., 2005, 43, 6, 304-312, https://doi.org/10.1093/chromsci/43.6.304
. [all data]
Garcia-Estaban, Ansorena, et al., 2004
Garcia-Estaban, M.; Ansorena, D.; Astiasaran, I.; Martin, D.; Ruiz, J.,
Comparison of simultaneous distillation extraction (SDE) and solid-phase microextraction (SPME) for the analysis of volatile compounds in dry-cured ham,
J. Sci. Food Agric., 2004, 84, 11, 1364-1370, https://doi.org/10.1002/jsfa.1826
. [all data]
Garcia-Estaban, Ansorena, et al., 2004, 2
Garcia-Estaban, M.; Ansorena, D.; Astiasarán, I.; Ruiz, J.,
Study of the effect of different fiber coatings and extraction conditions on dry cured ham volatile compounds extracted by solid-phase microextraction (SPME),
Talanta, 2004, 64, 2, 458-466, https://doi.org/10.1016/j.talanta.2004.03.007
. [all data]
Begnaud, Pérès, et al., 2003
Begnaud, F.; Pérès, C.; Berdagué, J.-L.,
Characterization of volatile effluents of livestock buildings by solid-phase microextraction,
Int. J. Environ. Anal. Chem., 2003, 83, 10, 837-849, https://doi.org/10.1080/03067310310001603349
. [all data]
Chung, Heymann, et al., 2003
Chung, S.-J.; Heymann, H.; Grün, I.U.,
Application of GPA and PLSR in correlating sensory and chemical data sets,
Food Qual. Pref., 2003, 14, 5-6, 485-495, https://doi.org/10.1016/S0950-3293(03)00010-7
. [all data]
Junkes, Castanho, et al., 2003
Junkes, B.S.; Castanho, R.D.M.; Amboni, C.; Yunes, R.A.; Heinzen, V.E.F.,
Semiempirical Topological Index: A Novel Molecular Descriptor for Quantitative Structure-Retention Relationship Studies,
Internet Electronic Journal of Molecular Design, 2003, 2, 1, 33-49. [all data]
Machiels, van Ruth, et al., 2003
Machiels, D.; van Ruth, S.M.; Posthumus, M.A.; Istasse, L.,
Gas chromatography-olfactometry analysis of the volatile compounds of two commercial Irish beef meats,
Talanta, 2003, 60, 4, 755-764, https://doi.org/10.1016/S0039-9140(03)00133-4
. [all data]
Variyar, Ahmad, et al., 2003
Variyar, P.S.; Ahmad, R.; Bhat, R.; Niyas, Z.; Sharma, A.,
Flavoring components of raw monsooned Arabica coffee and their changes during radiation processing,
J. Agric. Food Chem., 2003, 51, 27, 7945-7950, https://doi.org/10.1021/jf030408q
. [all data]
Ansorena, Gimeno, et al., 2001
Ansorena, D.; Gimeno, O.; Astiasarán, I.; Bello, J.,
Analysis of volatile compounds by GC-MS of a dry fermented sausage: chorizo de Pamplona,
Food Res. Int., 2001, 34, 1, 67-75, https://doi.org/10.1016/S0963-9969(00)00133-2
. [all data]
Madruga, Arruda, et al., 2000
Madruga, M.S.; Arruda, S.G.B.; Narain, N.; Souza, J.G.,
Castration and slaughter age effects on panel assessment and aroma compounds of the mestico goat meat,
Meat Sci., 2000, 56, 2, 117-125, https://doi.org/10.1016/S0309-1740(00)00025-5
. [all data]
Timón, Ventanas, et al., 1998
Timón, M.L.; Ventanas, J.; Martín, L.; Tejeda, J.F.; García, C.,
Volatile compounds in supercritical carbon dioxide extracts of Iberian ham,
J. Agric. Food Chem., 1998, 46, 12, 5143-5150, https://doi.org/10.1021/jf980652v
. [all data]
Buchbauer, Nikiforov, et al., 1994
Buchbauer, G.; Nikiforov, A.; Remberg, B.,
Headspace constituents of opium,
Planta Medica, 1994, 60, 2, 181-183, https://doi.org/10.1055/s-2006-959447
. [all data]
Ciccioli, Cecinato, et al., 1994
Ciccioli, P.; Cecinato, A.; Brancaleoni, E.; Brachetti, A.; Frattoni, M.; Sparapani, R.,
Composition and Distribution of Polar and Non-Polar VOCs in Urban, Rural, Forest and Remote Areas,
Eur Commission EUR, 1994, 549-568. [all data]
Ciccioli, Brancaleoni, et al., 1993
Ciccioli, P.; Brancaleoni, E.; Cecinato, A.; Sparapani, R.; Frattoni, M.,
Identification and determination of biogenic and anthropogenic volatile organic compounds in forest areas of Northern and Southern Europe and a remote site of the Himalaya region by high-resolution gas chromatography-mass spectrometry,
J. Chromatogr., 1993, 643, 1-2, 55-69, https://doi.org/10.1016/0021-9673(93)80541-F
. [all data]
Ibrahim and Suffet, 1988
Ibrahim, E.A.; Suffet, I.H.,
Freon FC-113, an Alternative to Methylene Chloride for Liquid-Liquid Extraction of Trace Organics from Chlorinated Drinking Water,
J. Chromatogr., 1988, 454, 217-232, https://doi.org/10.1016/S0021-9673(00)88615-X
. [all data]
Takeoka, Flath, et al., 1988
Takeoka, G.R.; Flath, R.A.; Güntert, M.; Jennings, W.,
Nectarine volatiles: vacuum steam distillation versus headspace sampling,
J. Agric. Food Chem., 1988, 36, 3, 553-560, https://doi.org/10.1021/jf00081a037
. [all data]
Ramsey and Flanagan, 1982
Ramsey, J.D.; Flanagan, R.J.,
Detection and Identification of Volatile Organic Compounds in Blood by Headspace Gas Chromatography as an Aid to the Diagnosis of Solvent Abuse,
J. Chromatogr., 1982, 240, 2, 423-444, https://doi.org/10.1016/S0021-9673(00)99622-5
. [all data]
Feng, Zhuang, et al., 2011
Feng, T.; Zhuang, H.; Ye, R.; Jin, Z.; Xu, X.; Xie, Z.,
Analysis of volatile compounds of Mesona Blumes gum/rice extrudates via GC-MS and electronic nose,
Sensors and Actuators B: Chemical, 2011, 160, 1, 964-973, https://doi.org/10.1016/j.snb.2011.09.013
. [all data]
Duarte, Dias, et al., 2010
Duarte, W.F.; Dias, D.R.; Oliveira, J.M.; Teixeira, J.A.; de Almeida e Silva, J.B.; Schwan, R.F.,
Characterization of different fruit wines made from cacao,cupuassu, gabiroba, jaboticaba and umbu,
Food Sci. Technol., 2010, 43, 1564-1572. [all data]
Karlsson, Birgersson, et al., 2009
Karlsson, M.F.; Birgersson, G.; Prado, A.M.C.; Bosa, F.; Bengtsson, M.; Witzgall, P.,
Plant Odor Analysis of Potato: Responce of Guatemalan Moth to Above- and Background Potato Volatiles,
J. Agric. Food Chem., 2009, 57, 13, 5903-5909, https://doi.org/10.1021/jf803730h
. [all data]
Mo, Fan, et al., 2009
Mo, X.; Fan, W.; Xu, Y.,
Changes in volatile compounds of Chinese rice wine wheat qu during fermentation and storage,
J. of the Institute of Brewing, 2009, 115, 4, 300-307, https://doi.org/10.1002/j.2050-0416.2009.tb00385.x
. [all data]
Zhao, Xu, et al., 2009
Zhao, Y.; Xu, Y.; Li, J.; Fan, W.; Jiang, W.,
Profile of volatile compounds in 11 brandies by headspace solid-phase microextraction followed by gas chromatography-mass spectrometry,
J. Food. Sci., 2009, 74, 2, c90-c99, https://doi.org/10.1111/j.1750-3841.2008.01029.x
. [all data]
Kaypak and Avsar, 2008
Kaypak, D.; Avsar, Y.K.,
Volatile and odor-active compounds of tuzlu yoghurt,
Asian J. Chem., 2008, 20, 5, 3641-3648. [all data]
Cros, Vandanjon, et al., 2007
Cros, S.; Vandanjon, L.; Jaouen, P.; Bourseau, P.,
Processing of Industrial Mussel Cooking Juices by Reverse Osmotis: Pollution Abatement and Aromas Recovery, 2007, retrieved from title of Internet file: [imstec064]. [all data]
Dury-Brun, Fournier, et al., 2007
Dury-Brun, C.; Fournier, N.; Pernin, K.; Guichard, E.; Voilley, A.,
A new approach to studying sponge cake aroma after storage in treated paper and plastic packaging by direct gas chromatography?olfactometry (D-GC-O),
Flavour Fragr. J., 2007, 22, 4, 255-264, https://doi.org/10.1002/ffj.1788
. [all data]
Rawat, Gulati, et al., 2007
Rawat, R.; Gulati, A.; Babu, G.D.K.; Acharya, R.; Kaul, V.K.; Singh, B.,
Characterization of volatile components of Kangra orthodox black tea by gas chromatography-mass spectrometry,
Food Chem., 2007, 105, 1, 229-235, https://doi.org/10.1016/j.foodchem.2007.03.071
. [all data]
Fan and Qian, 2006, 2
Fan, W.; Qian, M.C.,
Characterization of Aroma Compounds of Chinese Wuliangye and Jiannanchun Liquors by Aroma Extract Dilution Analysis,
J. Agric. Food Chem., 2006, 54, 7, 2695-2704, https://doi.org/10.1021/jf052635t
. [all data]
Komes, Ulrich, et al., 2006
Komes, D.; Ulrich, D.; Lovric, T.,
Characterization of odor-active compounds in Croatian Rhine Riesling wine, subregion Zagorje,
Eur. Food Res. Technol., 2006, 222, 1-2, 1-7, https://doi.org/10.1007/s00217-005-0094-y
. [all data]
Perestrelo, Fernandes, et al., 2006
Perestrelo, R.; Fernandes, A.; Albuquerque, F.F.; Marques, J.C.; Camara, J.S.,
Analytical characterization of the aroma of Tinta Negra Mole red wine: Identification of the main odorants compounds,
Anal. Chim. Acta., 2006, 563, 1-2, 154-164, https://doi.org/10.1016/j.aca.2005.10.023
. [all data]
Wierda R.L., Fletcher G., et al., 2006
Wierda R.L.; Fletcher G.; Xu L.; Dufour J.P.,
Analysis of volatile compounds as spoilage indicators in fresh king salmon (Oncorhynchus tshawytscha) during storage using SPME-GC-MS,
J. Agric. Food Chem., 2006, 54, 22, 8480-8490, https://doi.org/10.1021/jf061377c
. [all data]
Wu, Krings, et al., 2005
Wu, S.; Krings, U.; Zorn, H.; Berger, R.G.,
Volatile compounds from the fruiting bodies of beefsteak fungus Fistulina hepatica (Schaeffer: Fr.) Fr.,
Food Chem., 2005, 92, 2, 221-226, https://doi.org/10.1016/j.foodchem.2004.07.013
. [all data]
Chida, Sone, et al., 2004
Chida, M.; Sone, Y.; Tamura, H.,
Aroma characteristics of stored tobacco cut leaves analyzed by a high vacuum distillation and canister system,
J. Agric. Food Chem., 2004, 52, 26, 7918-7924, https://doi.org/10.1021/jf049223p
. [all data]
López, Ezpeleta, et al., 2004
López, R.; Ezpeleta, E.; Sánchez, I.; Cacho, J.; Ferreira, V.,
Analysis of the aroma intensities of volatile compounds released from mild acid hydrolysates of odourless precursors extracted from Tempranillo and Grenache grapes using gas chromatography-olfactometry,
Food Chem., 2004, 88, 1, 95-103, https://doi.org/10.1016/j.foodchem.2004.01.025
. [all data]
Cros, Vandanjon, et al., 2003, 2
Cros, S.; Vandanjon, L.; Jaouen, P.; Bourseau, P.,
IMSTEC'03 Conference Proceedings, Processing of industrial mussel cooking juices by reverse osmosis: pollution abatement and aromas recovery, Universoty of New South Wales, Sydney, Australia, 2003, 6. [all data]
Dregus and Engel, 2003
Dregus, M.; Engel, K.-H.,
Volatile constituents of uncooked Rhubarb (Rheum rhabarbarum L.) stalks,
J. Agric. Food Chem., 2003, 51, 22, 6530-6536, https://doi.org/10.1021/jf030399l
. [all data]
Lee and Noble, 2003
Lee, S.-J.; Noble, A.C.,
Characterization of odor-active compounds in Californian Chardonnay wines using GC-olfactometry and GC-mass spectrometry,
J. Agric. Food Chem., 2003, 51, 27, 8036-8044, https://doi.org/10.1021/jf034747v
. [all data]
Lin, Cai, et al., 2003
Lin, P.; Cai, J.; Li, J.; Sang, W.; Su, Q.,
Constituents of the essential oil of Hemerocallis flava day lily,
Flavour Fragr. J., 2003, 18, 6, 539-541, https://doi.org/10.1002/ffj.1264
. [all data]
Soria, Martinez-Castro, et al., 2003
Soria, A.C.; Martinez-Castro, I.; Sanz, J.,
Analysis of volatile composition of honey by solid phase microextraction and gas chromatographymass spectrometry,
J. Sep. Sci., 2003, 26, 9-10, 793-801, https://doi.org/10.1002/jssc.200301368
. [all data]
Tanaka, Yamauchi, et al., 2003
Tanaka, T.; Yamauchi, T.; Katsumata, R.; Kiuchi, K.,
Comparison of volatile components in commercial Itohiki-Natto by solid phase microextraction and gas chromatography,
Nippon Shokuhin Kagaku Kogaku Kaishi, 2003, 50, 6, 278-285, https://doi.org/10.3136/nskkk.50.278
. [all data]
Fu, Yoon, et al., 2002
Fu, S.-G.; Yoon, Y.; Basemore, R.,
Aroma-actie components in fermented bamboo shoots,
J. Agric. Food Chem., 2002, 50, 3, 549-554, https://doi.org/10.1021/jf010883t
. [all data]
Galindo-Cuspinera, Lubran, et al., 2002
Galindo-Cuspinera, V.; Lubran, M.B.; Rankin, S.A.,
Comparison of volatile compounds in water- and oil-soluble annatto (Bixa orellana L.) extracts,
J. Agric. Food Chem., 2002, 50, 7, 2010-2015, https://doi.org/10.1021/jf011325h
. [all data]
Sanz, Maeztu, et al., 2002
Sanz, C.; Maeztu, L.; Zapelena, M.J.; Bello, J.; Cid, C.,
Profiles of volatile compounds and sensory analysis of three blends of coffee: influence of different proportions of Arabica and Robusta and influence of roasting coffee with sugar,
J. Sci. Food Agric., 2002, 82, 8, 840-847, https://doi.org/10.1002/jsfa.1110
. [all data]
Umano, Hagi, et al., 2002
Umano, K.; Hagi, Y.; Shibamoto, T.,
Volatile chemicals identified in extracts from newly hybrid citrus, dekopon (Shiranuhi mandarin Suppl. J.),
J. Agric. Food Chem., 2002, 50, 19, 5355-5359, https://doi.org/10.1021/jf0203951
. [all data]
Duque, Bonilla, et al., 2001
Duque, C.; Bonilla, A.; Bautista, E.; Zea, S.,
Exudation of low molecular wight compounds (thiobismethane, methyl isocyanide, amd methyl isothiocyanate) as a possible chemical defense mechanism in the marine sponge Ircinia felix,
Biochem. Systematics Ecol., 2001, 29, 5, 459-467, https://doi.org/10.1016/S0305-1978(00)00081-8
. [all data]
Maeztu, Sanz, et al., 2001
Maeztu, L.; Sanz, C.; Andueza, S.; de Peña, M.P.; Bello, J.; Cid, C.,
Characterization of espresso coffee aroma by static headspace GC-MS and sensory flavor profile,
J. Agric. Food Chem., 2001, 49, 11, 5437-5444, https://doi.org/10.1021/jf0107959
. [all data]
Girard and Durance, 2000
Girard, B.; Durance, T.,
Headspace volatiles of sockeye and pink salmon as affected by retort process,
Food Chem. Toxicol., 2000, 65, 1, 34-39. [all data]
Umano, Hagi, et al., 2000
Umano, K.; Hagi, Y.; Nakahara, K.; Shoji, A.; Shibamoto, T.,
Volatile chemicals identified in extracts from leaves of Japanese mugwort (Artemisia princeps Pamp.),
J. Agric. Food Chem., 2000, 48, 8, 3463-3469, https://doi.org/10.1021/jf0001738
. [all data]
Hwan and Chou, 1999
Hwan, C.-H.; Chou, C.-C.,
Volatile components of the Chinese fermented soya bean curd as affected by the addition of ethanol in ageing solution,
J. Sci. Food Agric., 1999, 79, 2, 243-248, https://doi.org/10.1002/(SICI)1097-0010(199902)79:2<243::AID-JSFA179>3.0.CO;2-I
. [all data]
Kaya, Baser, et al., 1999
Kaya, A.; Baser, K.H.C.; Demirci, B.; Koca, F.,
The essential oil of Acinos alpinus (L.) Moench growing in Turkey,
Flavour Fragr. J., 1999, 14, 1, 55-59, https://doi.org/10.1002/(SICI)1099-1026(199901/02)14:1<55::AID-FFJ784>3.0.CO;2-Q
. [all data]
Umano, Nakahara, et al., 1999
Umano, K.; Nakahara, K.; Shoji, A.; Shibamoto, T.,
Aroma chemicals isolated and identified from leaves of aloe arborescens Mill. Var. natalensis Berger,
J. Agric. Food Chem., 1999, 47, 9, 3702-3705, https://doi.org/10.1021/jf990116i
. [all data]
Campeanu, Burcea, et al., 1998
Campeanu, G.; Burcea, M.; Doneanu, C.; Namolosanu, I.; Visan, L.,
GC/MS characterization of the volatiles isolated from the wines obtained from the indigenous cultivar Feteasca Regala,
Analusis, 1998, 26, 2, 93-97, https://doi.org/10.1051/analusis:1998117
. [all data]
Sekiwa, Kubota, et al., 1997
Sekiwa, Y.; Kubota, K.; Kobayashi, A.,
Characteristic flavor components in the brew of cooked clam (Meretrix lusoria) and the effect of storage on flavor formation,
J. Agric. Food Chem., 1997, 45, 3, 826-830, https://doi.org/10.1021/jf960433e
. [all data]
Wada and Shibamoto, 1997
Wada, K.; Shibamoto, T.,
Isolation and identification of volatile compounds from a wine using solid phase extraction, gas chromatography, and gas chromatography/mass spectrometry,
J. Agric. Food Chem., 1997, 45, 11, 4362-4366, https://doi.org/10.1021/jf970157j
. [all data]
Kubota, Matsujage, et al., 1996
Kubota, K.; Matsujage, Y.; Sekiwa, Y.; Kobayashi, A.,
Identification of the characteristic volatile flavor compounds formed by cooking squid (Todarodes pacificus Steenstrup),
Food Sci. Technol., 1996, 2, 3, 163-166. [all data]
Shuichi, Masazumi, et al., 1996
Shuichi, H.; Masazumi, N.; Hiromu, K.; Kiyoshi, F.,
Comparison of volatile compounds berween the crude drugs, Onji-tsutsu and Onji-niki,
Nippon nogei kagaku kaishi, 1996, 70, 2, 151-160. [all data]
Kawakami, Ganguly, et al., 1995
Kawakami, M.; Ganguly, S.N.; Banerjee, J.; Kobayashi, A.,
Aroma composition of oolong tea and black tea by brewed extraction method and characterizing compounds of Darjeeling tea aroma,
J. Agric. Food Chem., 1995, 43, 1, 200-207, https://doi.org/10.1021/jf00049a037
. [all data]
Kawakami, Kobayashi, et al., 1993
Kawakami, M.; Kobayashi, A.; Kator, K.,
Volatile constituents of Rooibos tea (Aspalathus linearis) as affected by extraction process,
J. Agric. Food Chem., 1993, 41, 4, 633-636, https://doi.org/10.1021/jf00028a023
. [all data]
Kawakami and Kobayashi, 1991
Kawakami, M.; Kobayashi, A.,
Volatitle constituents of greem mate and roasted mate,
J. Agric. Food Chem., 1991, 39, 7, 1275-1279, https://doi.org/10.1021/jf00007a016
. [all data]
Gyawali and Kim, 2012
Gyawali, R.; Kim, K.-S.,
Bioactive volatile compounds of three medicinal plants from Nepal,
Kathmandu Univ. J. Sci., Engineering and Technol., 2012, 8, 1, 51-62. [all data]
Prompona, Kandylis, et al., 2012
Prompona, K.-D.; Kandylis, P.; Tsakiris, A.; Kanellaki, M.; Kourkoutas, Y.,
Application of alternative technologies for elimination of artificial colorings in alcoholic beverages produced by Citrus medica and potential impact on human health,
Food Nutrition Sci., 2012, 3, 07, 959-969, https://doi.org/10.4236/fns.2012.37127
. [all data]
Welke, Manfroi, et al., 2012
Welke, J.E.; Manfroi, V.; Zanus, M.; Lazarotto, M.; Zini, C.A.,
Characterization of the volatile profile of Brazilian merlot wines through comprehensive two dimensional gas chromatography time-of-flight mass spectrometric detection,
J. Chromatogr. A, 2012, 1226, 124-139, https://doi.org/10.1016/j.chroma.2012.01.002
. [all data]
Johanningsmeier and McFeeters, 2011
Johanningsmeier, S.D.; McFeeters, R.F.,
Detection of volatile spoilage metabolites in fermented cucumbers using nontargeted, comprehensive 2-dimensional gas chromatography-time-of-flight mass spectrometry (GCxGCxTOFMS),
J. Food Sci., 2011, 76, 1, c168-c177, https://doi.org/10.1111/j.1750-3841.2010.01918.x
. [all data]
Sampaio, Garruti, et al., 2011
Sampaio, K.S.; Garruti, D.S.; Franco, M.R.B.; Janzantti, N.S.; Da Silva, M.A.AP.,
Aroma volatiles recovered in the water phase of cashew apple (Anacardium occidentale L.) juice during concentration,
J. Sci. Food Agric., 2011, 91, 10, 1801-1809, https://doi.org/10.1002/jsfa.4385
. [all data]
Xiao, Dai, et al., 2011
Xiao, Z.; Dai, S.; Niu, Y.; Yu, H.; Zhu, J.; Tian, H.; Gu, Y.,
Discrimination of Chinese vinegars based on headspace solid-phase microextraction - gas chromatography mass spectrometry of volatile compounds and multivariate analysis,
J. Food Sci., 2011, 76, 8, c1125-c1135, https://doi.org/10.1111/j.1750-3841.2011.02356.x
. [all data]
Vekiari, Orepoulou, et al., 2010
Vekiari, S.A.; Orepoulou, V.; Kourkoutas, Y.; Kamoun, N.; Msallem, M.; Psimouli, V.; Arapoglou, D.,
Characterization and seasonal variations of the quality of virgin olive oil of the Thoumbolia and Koroneiki varieties from Southern Greece,
Grasas y Aceites, 2010, 61, 3, 221-231, https://doi.org/10.3989/gya.108709
. [all data]
Canuti, Conversano, et al., 2009
Canuti, V.; Conversano, M.; Li Calzi, M.; Heymann, H.; Matthews, M.A.; Ebeler, S.E.,
Headspace solid-phase microextraction - gas chromatography - mass spectrometry for profiling free volatile compounds in Cabernet Sauvignon grapes and vines,
J. Chromatogr. A., 2009, 1216, 15, 3012-3022, https://doi.org/10.1016/j.chroma.2009.01.104
. [all data]
Zhang, Zhang, et al., 2008
Zhang, C.; Zhang, H.; Wang, L.; Guo, X.,
Effect of carrot (Daucus carota) antifreeze proteins on texture preperties of frozen dough and volatile compounds of crumb,
Food. Sci. Technol. (Lebesmittel-Wissenschaft und Technologie), 2008, 41, 6, 1029-1036, https://doi.org/10.1016/j.lwt.2007.07.010
. [all data]
Berard, Bianchi, et al., 2007
Berard, J.; Bianchi, F.; Careri, M.; Chatel, A.; Mangia, A.; Musci, M.,
Characterization of the volatile fraction and of free fatty acids of Fontina Valle d'Aosta, a protected designation of origin Italian cheese,
Food Chem., 2007, 105, 1, 293-300, https://doi.org/10.1016/j.foodchem.2006.11.041
. [all data]
Pontes, Marques, et al., 2007
Pontes, M.; Marques, J.C.; Camara, J.S.,
Screening of volatile composition from Portuguese multifloral honeys using headspace solid-phase microextraction-gas chromatography-quadrupole mass spectrometry,
Talanta, 2007, 74, 1, 91-103, https://doi.org/10.1016/j.talanta.2007.05.037
. [all data]
Tian, Zhang, et al., 2007
Tian, Y.; Zhang, X.; Huang, T.; Zou, K.; Zhou, J.,
Research advances on the essential oils from leaves of Eucalyptus,
Food Fermentation Ind. (Chinese), 2007, 33, 10, 143-147. [all data]
Vichi, Guadayol, et al., 2007
Vichi, S.; Guadayol, J.M.; Caixach, J.; López-Tamames, E.; Buxaderas, S.,
Analytical, Nutritional, and Clinical Methods. Comparative study of different extraction techniques for the analysis of virgin olive oil aroma,
Food Chem., 2007, 105, 3, 1171-1178, https://doi.org/10.1016/j.foodchem.2007.02.018
. [all data]
Viegas and Bassoli, 2007
Viegas, M.C.; Bassoli, D.G.,
Utilizacao do indice de retencao linear para caracterizacao de compostos volateis em cafe soluvel utilizando GC-MS e coluna HP-Innowax,
Quim. Nova, 2007, 30, 8, 2031-2034, https://doi.org/10.1590/S0100-40422007000800040
. [all data]
Zhang C., Zhang H., et al., 2007
Zhang C.; Zhang H.; Wang L.; Gao H.; Guo X.N.; Yao H.Y.,
Improvement of texture properties and flavor of frozen dough by carrot (Daucus carota) antifreeze protein supplementation,
J. Agric. Food Chem., 2007, 55, 23, 9620-9626, https://doi.org/10.1021/jf0717034
. [all data]
Baser K.H.C., Ozek G., et al., 2006
Baser K.H.C.; Ozek G.; Ozek T.; Duran A.,
Composition of the essential oil of Centaurea huber-morathii Wagenitz isolated from seeds by microdistillation,
Flavour Fragr. J., 2006, 21, 3, 568-570, https://doi.org/10.1002/ffj.1620
. [all data]
Baser, Özek, et al., 2004
Baser, K.H.C.; Özek, T.; Kirimer, N.; Deliorman, D.; Ergun, F.,
Composition of the essential oils of Galium aparine L. and Galium odoratum (L.) Scop. from Turkey,
J. Essent. Oil Res., 2004, 16, 4, 305-307, https://doi.org/10.1080/10412905.2004.9698728
. [all data]
Tasdemir, Demirci, et al., 2003
Tasdemir, D.; Demirci, B.; Demirci, F.; Dönmez, A.A.; Baser, K.H.C.; Rüedi, P.,
Analysis of the Volatile Components of Five Turkish Rhododendron Species by Headspace Solid-Phase Microextraction and GC-MS (HS-SPME-GC-MS),
Z. Naturforsch., 2003, 58c, 797-803. [all data]
Tunaher, Kirimer, et al., 2003
Tunaher, Z.; Kirimer, N.; Baser, K.H.C.,
Wood essential oils of Juniperus foetidissima Willd.,
Holzforschung, 2003, 57, 140-144. [all data]
López and Dufour, 2001
López, M.G.; Dufour, J.P.,
Chapter 6. Tequilas: charm analysis of Blanco, Teposado, and Anejo tequilas,
Am. Chem. Soc. Symp. Ser., 2001, 782, 62-72. [all data]
Baser, Kürkcüoglu, et al., 1998
Baser, K.H.C.; Kürkcüoglu, M.; Aytac, Z.,
Composition of the essential oil of Salvia euphratica Montbret ex Bentham var. euphratica from Turkey,
Flavour Fragr. J., 1998, 13, 1, 63-64, https://doi.org/10.1002/(SICI)1099-1026(199801/02)13:1<63::AID-FFJ694>3.0.CO;2-Z
. [all data]
Ziegleder, 1998
Ziegleder, G.,
Volatile and odorous compounds in unprinted paperboard,
Packag. Technol. Sci., 1998, 11, 5, 231-239, https://doi.org/10.1002/(SICI)1099-1522(1998090)11:5<231::AID-PTS437>3.0.CO;2-A
. [all data]
Castioni and Kapetanidis, 1996
Castioni, P.; Kapetanidis, I.,
Volatile constituents from Brunfelsia grandiflora ssp. grandiflora: qualitative analysis by GC-MS,
Scientia Pharmaceutica, 1996, 64, 83-91. [all data]
Luning, de Rijk, et al., 1994
Luning, P.A.; de Rijk, T.; Wichers, H.J.; Roozen, J.P.,
Gas chromatography, mass spectrometry, and sniffing port analyses of volatile compounds of fresh bell peppers (Capsicum annuum) at different ripening stages,
J. Agric. Food Chem., 1994, 42, 4, 977-983, https://doi.org/10.1021/jf00040a027
. [all data]
Mattheis, Buchanan, et al., 1992
Mattheis, J.P.; Buchanan, D.A.; Fellman, J.K.,
Volatile compounds emitted by sweet cherries (Prunus avium Cv. Bing) during fruit development and ripening,
J. Agric. Food Chem., 1992, 40, 3, 471-474, https://doi.org/10.1021/jf00015a022
. [all data]
Fuentes, Font, et al., 2007
Fuentes, M.J.; Font, R.; Gomez-Rico, M.F.; Martin-Gullon, I.,
Pyrolysis and combustion of waste lubricant oil from diesel cars: Decomposition and pollutants,
J. Anal. Appl. Pyrolysis, 2007, 79, 1-2, 215-226, https://doi.org/10.1016/j.jaap.2006.12.004
. [all data]