Benzene, decyl-
- Formula: C16H26
- Molecular weight: 218.3776
- IUPAC Standard InChIKey: UZILCZKGXMQEQR-UHFFFAOYSA-N
- CAS Registry Number: 104-72-3
- Chemical structure:
View 3d structure (requires JavaScript / HTML 5) - Other names: Decane, 1-phenyl-; n-Decylbenzene; Decylbenzene; 1-Phenyldecane

Gas phase thermochemistry data

Data compiled by: Glushko Thermocenter, Russian Academy of Sciences, Moscow
Quantity | Value | Units | Method | Reference | Comment |
---|---|---|---|---|---|
S°gas | 674.0 ± 2.1 | J/mol*K | N/A | Messerly J.F., 1965 |

Condensed phase thermochemistry data

Data compiled by: Hussein Y. Afeefy, Joel F. Liebman, and Stephen E. Stein
Quantity | Value | Units | Method | Reference | Comment |
---|---|---|---|---|---|
ΔfH°liquid | -219.1 ± 2.0 | kJ/mol | Ccb | Fraser and Prosen, 1955 | |
Quantity | Value | Units | Method | Reference | Comment |
ΔcH°liquid | -9796.3 ± 3.7 | kJ/mol | Ccb | Loeffler and Rossini, 1960 | Corresponding ΔfHºliquid = -215.66 kJ/mol (simple calculation by NIST; no Washburn corrections) |
ΔcH°liquid | -9793.0 ± 1.8 | kJ/mol | Ccb | Fraser and Prosen, 1955 | Corresponding ΔfHºliquid = -218.9 kJ/mol (simple calculation by NIST; no Washburn corrections) |

Phase change data

Data compiled as indicated in comments:
BS - Robert L. Brown and Stephen E. Stein
TRC - Thermodynamics Research Center, NIST Boulder Laboratories, Chris Muzny director
AC - William E. Acree, Jr., James S. Chickos
Quantity | Value | Units | Method | Reference | Comment |
---|---|---|---|---|---|
Tboil | 566.2 | K | N/A | Aldrich Chemical Company Inc., 1990 | BS |
Quantity | Value | Units | Method | Reference | Comment |
Tfus | 258.74 ± 0.06 | K | AVG | N/A | Average of 9 values; Individual data points |
Quantity | Value | Units | Method | Reference | Comment |
Ttriple | 258.75 | K | N/A | Messerly, Todd, et al., 1965 | Crystal phase 1 phase; Uncertainty assigned by TRC = 0.02 K; TRC |
Quantity | Value | Units | Method | Reference | Comment |
ΔvapH° | 78.2 ± 0.3 | kJ/mol | GS | Verevkin, 2006 | Based on data from 318. to 363. K.; AC |
ΔvapH° | 79.8 | kJ/mol | N/A | Reid, 1972 | AC |
Enthalpy of vaporization
ΔvapH (kJ/mol) | Temperature (K) | Method | Reference | Comment |
---|---|---|---|---|
78.0 | 328. | N/A | Kasehgari, Mokbel, et al., 1993 | Based on data from 313. to 433. K.; AC |
75.1 | 386. | A | Stephenson and Malanowski, 1987 | Based on data from 371. to 427. K.; AC |
61.6 | 490. | A,IP | Stephenson and Malanowski, 1987 | Based on data from 475. to 571. K. See also Camin, Forziati, et al., 1954.; AC |
Antoine Equation Parameters
log10(P) = A − (B / (T + C))
P = vapor pressure (bar)
T = temperature (K)
View plot Requires a JavaScript / HTML 5 canvas capable browser.
Temperature (K) | A | B | C | Reference | Comment |
---|---|---|---|---|---|
476.14 to 570.9 | 4.17104 | 1912.506 | -111.891 | Camin, Forziati, et al., 1954 | Coefficents calculated by NIST from author's data. |

Kovats' RI, non-polar column, isothermal

View large format table.

Column type Active phase Temperature (C) I Reference Comment
CapillaryDB-1140.1655.Beens, Tijssen, et al., 199810. m/0.25 mm/0.25 μm, He
PackedSqualane95.41627.Soják, Janák, et al., 1977
CapillaryApiezon200.1694.Schomburg, 1966

Kovats' RI, non-polar column, temperature ramp

View large format table.

Column type Active phase I Reference Comment
CapillaryOV-1011659.Hayes and Pitzer, 1982110. m/0.25 mm/0.20 μm, He, 1. K/min; Tstart: 35. C; Tend: 200. C

Van Den Dool and Kratz RI, non-polar column, temperature ramp

View large format table.

Column type Active phase I Reference Comment
CapillaryDB-51674.8Song, Lai, et al., 200330. m/0.25 mm/0.25 μm, He, 4. K/min; Tstart: 40. C; Tend: 310. C
CapillaryDB-51674.5Song, Lai, et al., 200330. m/0.25 mm/0.25 μm, He, 40. C @ 5. min, 4. K/min; Tend: 310. C
CapillaryDB-51669.5Song, Lai, et al., 200330. m/0.25 mm/0.25 μm, He, 2. K/min; Tstart: 40. C; Tend: 310. C
CapillaryDB-51674.8Song, Lai, et al., 200330. m/0.25 mm/0.25 μm, He, 4. K/min; Tstart: 40. C; Tend: 310. C
CapillaryDB-51677.7Song, Lai, et al., 200330. m/0.25 mm/0.25 μm, He, 6. K/min; Tstart: 40. C; Tend: 310. C
CapillaryDB-11645.Beens, Tijssen, et al., 199810. m/0.25 mm/0.25 μm, He, 2. K/min; Tstart: 30. C; Tend: 225. C
CapillaryDB-51669.5Lai and Song, 199530. m/0.25 mm/0.25 μm, He, 2. K/min; Tstart: 40. C; Tend: 310. C
CapillaryDB-51674.8Lai and Song, 199530. m/0.25 mm/0.25 μm, He, 4. K/min; Tstart: 40. C; Tend: 310. C
CapillaryDB-51677.7Lai and Song, 199530. m/0.25 mm/0.25 μm, He, 6. K/min; Tstart: 40. C; Tend: 310. C
CapillaryDB-51674.8Lai and Song, 199530. m/0.25 mm/0.25 μm, He, 4. K/min; Tstart: 40. C; Tend: 310. C
CapillaryDB-51674.5Lai and Song, 199530. m/0.25 mm/0.25 μm, He, 40. C @ 5. min, 4. K/min; Tend: 310. C
CapillaryDB-11664.Peng, Hua, et al., 199230. m/0.32 mm/1.5 μm, 40. C @ 4. min, 8. K/min; Tend: 280. C
CapillaryUltra-11655.82Haynes and Pitzer, 198550. m/0.22 mm/0.33 μm, He, 1. K/min; Tstart: -30. C; Tend: 240. C
CapillaryUltra-11661.14Haynes and Pitzer, 198550. m/0.22 mm/0.33 μm, He, 2. K/min; Tstart: -30. C; Tend: 240. C
CapillaryUltra-11664.63Haynes and Pitzer, 198550. m/0.22 mm/0.33 μm, He, 3. K/min; Tstart: -30. C; Tend: 240. C
CapillaryUltra-21675.02Haynes and Pitzer, 198550. m/0.22 mm/0.33 μm, He, 1. K/min; Tstart: -30. C; Tend: 240. C
CapillaryUltra-21680.77Haynes and Pitzer, 198550. m/0.22 mm/0.33 μm, He, 2. K/min; Tstart: -30. C; Tend: 240. C
CapillaryUltra-21684.34Haynes and Pitzer, 198550. m/0.22 mm/0.33 μm, He, 3. K/min; Tstart: -30. C; Tend: 240. C
CapillaryOV-1011659.Hayes and Pitzer, 1981108. m/0.25 mm/0.2 μm, 1. K/min; Tstart: 35. C; Tend: 200. C

Van Den Dool and Kratz RI, non-polar column, custom temperature program

View large format table.

Column type Active phase I Reference Comment
CapillaryDB-11659.Peng, 200015. m/0.53 mm/1. μm, He; Program: 40C(3min) => 8C/min => 200(1min) => 5C/min => 300C(25min)

Van Den Dool and Kratz RI, polar column, temperature ramp

View large format table.

Column type Active phase I Reference Comment
CapillaryDB-Wax1962.Peng, 200015. m/0.53 mm/1. μm, He, 40. C @ 3. min, 5. K/min, 220. C @ 30. min
CapillaryHP-Wax1953.Peng, 200015. m/0.53 mm/1. μm, He, 40. C @ 3. min, 5. K/min, 220. C @ 30. min
CapillaryDB-Wax1928.Peng, Hua, et al., 199230. m/0.53 mm/1. μm, 40. C @ 4. min, 8. K/min, 200. C @ 20. min

Normal alkane RI, non-polar column, custom temperature program

View large format table.

Column type Active phase I Reference Comment
CapillaryDB-11664.Peng, 199630. m/0.53 mm/1.5 μm; Program: 40 0C (4 min) 8 0C/min -> 200 0C (1 min) 5 0C/min -> 280 0C (20 min)
CapillaryMethyl Silicone1627.Bonchev, Mekenjan, et al., 1979Program: not specified

Normal alkane RI, polar column, custom temperature program

View large format table.

Column type Active phase I Reference Comment
CapillaryDB-Wax1928.Peng, 199630. m/0.53 mm/1.0 μm; Program: 40 0C (4 min) 4 0C/min -> 200 0C (20 min)

Lee's RI, non-polar column, temperature ramp

View large format table.

Column type Active phase I Reference Comment
CapillaryDB-5280.9Donnelly, Abdel-Hamid, et al., 199330. m/0.32 mm/0.25 μm, He, 40. C @ 3. min, 8. K/min, 285. C @ 29.5 min
CapillaryDB-5284.697Tong, Shore, et al., 1984He, 80. C @ 1. min, 3. K/min, 300. C @ 10. min; Column length: 30. m; Column diameter: 0.32 mm

References

Messerly J.F., 1965
Messerly J.F.,
Low-temperature thermodynamic properties of n-propyl- and n-butyl-benzene,
J. Phys. Chem., 1965, 69, 4304-4310. [all data]
Fraser and Prosen, 1955
Fraser, F.M.; Prosen, E.J.,
Heats of combustion of liquid n-hexadecane, 1-hexadecene, n-decylbenzene, n-decylcyclohexane, n-decylcyclopentane, and the variation of heat of combustion with chain length,
J. Res. NBS, 1955, 55, 329-333. [all data]
Loeffler and Rossini, 1960
Loeffler, S.M.C.; Rossini, F.D.,
Heats of combustion and formation of the higher normal alkyl cyclopentanes, cyclohexanes, benzenes and 1-alkenes in the liquid state at 25°,
J. Phys. Chem., 1960, 64, 1530-1533. [all data]
Aldrich Chemical Company Inc., 1990
Aldrich Chemical Company Inc.,
Catalog Handbook of Fine Chemicals, Aldrich Chemical Company, Inc., Milwaukee WI, 1990, 1. [all data]
Messerly, Todd, et al., 1965
Messerly, J.F.; Todd, S.S.; Finke, H.L.,
Low-Temperature Thermodynamic Prop. of n-Propyl and n-Butylbenzenes,
J. Phys. Chem., 1965, 69, 4304-11. [all data]
Verevkin, 2006
Verevkin, Sergey P.,
Vapour pressures and enthalpies of vaporization of a series of the linear n-alkyl-benzenes,
The Journal of Chemical Thermodynamics, 2006, 38, 9, 1111-1123, https://doi.org/10.1016/j.jct.2005.11.009
. [all data]
Reid, 1972
Reid, Robert C.,
Handbook on vapor pressure and heats of vaporization of hydrocarbons and related compounds, R. C. Wilhort and B. J. Zwolinski, Texas A Research Foundation. College Station, Texas(1971). 329 pages.$10.00,
AIChE J., 1972, 18, 6, 1278-1278, https://doi.org/10.1002/aic.690180637
. [all data]
Kasehgari, Mokbel, et al., 1993
Kasehgari, H.; Mokbel, I.; Viton, C.; Jose, J.,
Vapor pressure of 11 alkylbenzenes in the range 10-3 -- 280 torr, correlation by equation of state,
Fluid Phase Equilibria, 1993, 87, 1, 133-152, https://doi.org/10.1016/0378-3812(93)85022-E
. [all data]
Stephenson and Malanowski, 1987
Stephenson, Richard M.; Malanowski, Stanislaw,
Handbook of the Thermodynamics of Organic Compounds, 1987, https://doi.org/10.1007/978-94-009-3173-2
. [all data]
Camin, Forziati, et al., 1954
Camin, David L.; Forziati, Alphonse F.; Rossini, Frederick D.,
Physical Properties of n-Hexadecane, n-Decylcyclopentane, n-Decylcyclohexane, 1-Hexadecene and n-Decylbenzene,
J. Phys. Chem., 1954, 58, 5, 440-442, https://doi.org/10.1021/j150515a015
. [all data]