2-Propen-1-ol, 3-phenyl-, formate
- Formula: C10H10O2
- Molecular weight: 162.1852
- IUPAC Standard InChIKey: LBHJXKYRYCUGPD-QPJJXVBHSA-N
- CAS Registry Number: 104-65-4
- Chemical structure:
View 3d structure (requires JavaScript / HTML 5) - Other names: Cinnamyl alcohol, formate; γ-Phenylallyl formate; Cinnamyl formate; Cinnamyl methanoate; Formic acid, cinnamyl ester; 3-Phenyl-2-propen-1-yl formate

Van Den Dool and Kratz RI, non-polar column, temperature ramp

Column type | Active phase | I | Reference | Comment |
---|---|---|---|---|
Packed | SE-30 | 1332. | van den Dool and Kratz, 1963 | Celite; Tstart: 75. C; Tend: 228. C |

Normal alkane RI, non-polar column, custom temperature program

Column type | Active phase | I | Reference | Comment |
---|---|---|---|---|
Capillary | SE-30 | 1330. | Vinogradov, 2004 | Program: not specified |
Capillary | OV-101 | 1330. | Shibamoto, 1987 | Program: not specified |

Normal alkane RI, polar column, custom temperature program

Column type | Active phase | I | Reference | Comment |
---|---|---|---|---|
Capillary | Carbowax 20M | 2094. | Vinogradov, 2004 | Program: not specified |
Capillary | Carbowax 20M | 2094. | Shibamoto, 1987 | Program: not specified |

References

van den Dool and Kratz, 1963
van den Dool, H.; Kratz, P. Dec.,
A generalization of the retention index system including linear temperature programmed gas-liquid partition chromatography,
J. Chromatogr., 1963, 11, 463-471, https://doi.org/10.1016/S0021-9673(01)80947-X
. [all data]
Vinogradov, 2004
Vinogradov, B.A.,
Production, composition, properties and application of essential oils, 2004, retrieved from http://viness.narod.ru. [all data]
Shibamoto, 1987
Shibamoto, T.,
Retention Indices in Essential Oil Analysis
in Capillary Gas Chromatography in Essential Oil Analysis, Sandra, P.; Bicchi, C., ed(s)., Hutchig Verlag, Heidelberg, New York, 1987, 259-274. [all data]