2-Propenal, 3-phenyl-
- Formula: C9H8O
- Molecular weight: 132.1592
- IUPAC Standard InChIKey: KJPRLNWUNMBNBZ-UHFFFAOYSA-N
- CAS Registry Number: 104-55-2
- Chemical structure:
View 3d structure (requires JavaScript / HTML 5) - Stereoisomers:
- Other names: Cinnamaldehyde; Acrolein, 3-phenyl-; Benzylideneacetaldehyde; Cassia aldehyde; Cinnamal; Cinnamic aldehyde; Cinnamylaldehyde; Phenylacrolein; 3-Phenyl-2-propenal; 3-Phenyl-2-propenaldehyde; 3-Phenylacrolein; 3-Phenylpropenal; NCI-C56111; Zimtaldehyde; Aldehyd skoricovy; 3-Fenylpropenal; 3-Phenylacrylaldehyde; Abion CA; 2-Propenaldehyde, 3-phenyl-; Propenaldehyde, 3-phenyl-; 3-Phenyl-2-propen-1-al; NSC 16935; (E)-Cinnamaldehyde; cinnamaldehyde (3-phenyl-2-propenal); 3-Phenyl-2-propenal (cinnamaldehyde)

Phase change data

Data compiled as indicated in comments:
TRC - Thermodynamics Research Center, NIST Boulder Laboratories, Chris Muzny director
AC - William E. Acree, Jr., James S. Chickos
Quantity | Value | Units | Method | Reference | Comment |
---|---|---|---|---|---|
Tfus | 265.7 | K | N/A | Altschul and Von Schneider, 1895 | Uncertainty assigned by TRC = 0.7 K; TRC |
Quantity | Value | Units | Method | Reference | Comment |
ΔvapH° | 62.4 | kJ/mol | GC | van Roon, Parsons, et al., 2002 | AC |
Enthalpy of vaporization
ΔvapH (kJ/mol) | Temperature (K) | Method | Reference | Comment |
---|---|---|---|---|
51.7 | 444. | TGA | Hazra, Dollimore, et al., 2002 | Based on data from 408. to 482. K.; AC |
58.2 | 364. | A | Stephenson and Malanowski, 1987 | Based on data from 349. to 519. K. See also Stull, 1947.; AC |
72.7 | 363. | A | Stephenson and Malanowski, 1987 | Based on data from 353. to 373. K.; AC |
Antoine Equation Parameters
log10(P) = A − (B / (T + C))
P = vapor pressure (bar)
T = temperature (K)
View plot Requires a JavaScript / HTML 5 canvas capable browser.
Temperature (K) | A | B | C | Reference | Comment |
---|---|---|---|---|---|
349.3 to 519. | 5.45068 | 2676.568 | -27.816 | Stull, 1947 | Coefficents calculated by NIST from author's data. |

Gas phase ion energetics data

Data compiled by: John E. Bartmess
Electron affinity determinations
EA (eV) | Method | Reference | Comment |
---|---|---|---|
0.823 ± 0.043 | ECD | Wentworth and Chen, 1967 |

Normal alkane RI, polar column, custom temperature program

Data compiled by: NIST Mass Spectrometry Data Center, William E. Wallace, director

Column type CapillaryCapillaryCapillaryCapillaryCapillary
Active phase HP-20MDB-WaxCarbowax 20MHP-InnowaxCarbowax 20M
Column length (m)  30. 30.
Carrier gas  He He
Substrate
Column diameter (mm)  0.32 0.32
Phase thickness (μm)  0.25 0.5
Program not specified45C(5min) => 5C/min => 150C => 10C/min => 240C (10min)not specified50C(4min) => 10C/min => 230C(10min) => 10C/min => 250Cnot specified
I 2018.2003.1996.2063.1996.
ReferenceChaieb, Hajlaoui, et al., 2007Krings, Zelena, et al., 2006Vinogradov, 2004Piasenzotto, Gracco, et al., 2003Shibamoto, 1987
Comment MSDC-RI MSDC-RI MSDC-RI MSDC-RI MSDC-RI

Van Den Dool and Kratz RI, non-polar column, custom temperature program

Data compiled by: NIST Mass Spectrometry Data Center, William E. Wallace, director

Column type CapillaryCapillary
Active phase SLB-5MSSE-52
Column length (m) 30.60.
Carrier gas  He
Substrate
Column diameter (mm) 0.250.32
Phase thickness (μm) 0.250.40
Program not specified45 C (6 min) 3 C/min -> 111 0C 2 C/min -> 160 C 3 C/min -> 300 C (15 min)
I 1273.1274.
ReferenceMondello, Sciarrone, et al., 2007Mondello, Dugo, et al., 1995
Comment MSDC-RI MSDC-RI

Kovats' RI, polar column, temperature ramp

Data compiled by: NIST Mass Spectrometry Data Center, William E. Wallace, director

Column type CapillaryCapillaryCapillary
Active phase SupelcowaxSupelcowaxCarbowax 20M
Column length (m) 30.30.50.
Carrier gas
Substrate
Column diameter (mm) 0.250.250.22
Phase thickness (μm) 0.250.25
Tstart (C) 60.60.80.
Tend (C) 240.240.200.
Heat rate (K/min) 3.3.2.
Initial hold (min) 5.5.
Final hold (min) 10.10.
I 1996.1996.1986.
ReferenceRiu-Aumatell, Castellari, et al., 2004Riu-Aumatell, Castellari, et al., 2004Nishimura, Yamaguchi, et al., 1989
Comment MSDC-RI MSDC-RI MSDC-RI

References

Altschul and Von Schneider, 1895
Altschul, M.; Von Schneider, B.,
Freezing points of some organic fluids,
Z. Phys. Chem., Stoechiom. Verwandtschaftsl., 1895, 16, 24. [all data]
van Roon, Parsons, et al., 2002
van Roon, André; Parsons, John R.; Govers, Harrie A.J.,
Gas chromatographic determination of vapour pressure and related thermodynamic properties of monoterpenes and biogenically related compounds,
Journal of Chromatography A, 2002, 955, 1, 105-115, https://doi.org/10.1016/S0021-9673(02)00200-5
. [all data]
Hazra, Dollimore, et al., 2002
Hazra, Anasuya; Dollimore, David; Alexander, Kenneth,
Thermal analysis of the evaporation of compounds used in aromatherapy using thermogravimetry,
Thermochimica Acta, 2002, 392-393, 221-229, https://doi.org/10.1016/S0040-6031(02)00104-1
. [all data]
Stephenson and Malanowski, 1987
Stephenson, Richard M.; Malanowski, Stanislaw,
Handbook of the Thermodynamics of Organic Compounds, 1987, https://doi.org/10.1007/978-94-009-3173-2
. [all data]
Stull, 1947
Stull, Daniel R.,
Vapor Pressure of Pure Substances. Organic and Inorganic Compounds,
Ind. Eng. Chem., 1947, 39, 4, 517-540, https://doi.org/10.1021/ie50448a022
. [all data]
Wentworth and Chen, 1967
Wentworth, W.E.; Chen, E.,
Experimental Determination of the Electron Affinity of Several Aromatic Aldehydes and Ketones,
J. Phys. Chem., 1967, 71, 6, 1929, https://doi.org/10.1021/j100865a063
. [all data]