1H-Imidazole, 1,5-dimethyl-
- Formula: C5H8N2
- Molecular weight: 96.1304
- IUPAC Standard InChIKey: HQNBJNDMPLEUDS-UHFFFAOYSA-N
- CAS Registry Number: 10447-93-5
- Chemical structure:
View 3d structure (requires JavaScript / HTML 5) - Other names: 1,5-Dimethylimidazole

Phase change data

Data compiled by: Robert L. Brown and Stephen E. Stein
Quantity | Value | Units | Method | Reference | Comment |
---|---|---|---|---|---|
Tboil | 494.2 | K | N/A | Weast and Grasselli, 1989 |

Gas phase ion energetics data

Data evaluated by: Edward P. Hunter and Sharon G. Lias
Quantity | Value | Units | Method | Reference | Comment |
---|---|---|---|---|---|
Proton affinity (review) | 977.6 | kJ/mol | N/A | Hunter and Lias, 1998 | |
Quantity | Value | Units | Method | Reference | Comment |
Gas basicity | 945.8 | kJ/mol | N/A | Hunter and Lias, 1998 |

Kovats' RI, non-polar column, isothermal

Column type | Active phase | Temperature (C) | I | Reference | Comment |
---|---|---|---|---|---|
Capillary | OV-101 | 110. | 1083. | Golovnya, Zhuravleva, et al., 1992 | 30. m/0.30 mm/0.20 μm |

Kovats' RI, polar column, isothermal

Column type | Active phase | Temperature (C) | I | Reference | Comment |
---|---|---|---|---|---|
Capillary | PEG-40M/KF | 170. | 1834. | Golovnya, Zhuravleva, et al., 1992 | 30. m/0.3 mm/0.2 μm |

References

Weast and Grasselli, 1989
CRC Handbook of Data on Organic Compounds, 2nd Editon, Weast,R.C and Grasselli, J.G., ed(s)., CRC Press, Inc., Boca Raton, FL, 1989, 1. [all data]
Hunter and Lias, 1998
Hunter, E.P.; Lias, S.G.,
Evaluated Gas Phase Basicities and Proton Affinities of Molecules: An Update,
J. Phys. Chem. Ref. Data, 1998, 27, 3, 413-656, https://doi.org/10.1063/1.556018
. [all data]
Golovnya, Zhuravleva, et al., 1992
Golovnya, R.V.; Zhuravleva, I.L.; Sal'kova, M.A.,
Prediction of Retention Indexes of Alkylimadazoles Under Conditions of Capillary Gas Chromatography,
J. Anal. Chem. USSR (Engl. Transl.), 1992, 7, 932-937. [all data]