Anethole
- Formula: C10H12O
- Molecular weight: 148.2017
- IUPAC Standard InChIKey: RUVINXPYWBROJD-UHFFFAOYSA-N
- CAS Registry Number: 104-46-1
- Chemical structure:
View 3d structure (requires JavaScript / HTML 5) - Stereoisomers:
- Other names: Benzene, 1-methoxy-4-(1-propenyl)-; Anisole, p-propenyl-; p-(1-Propenyl)anisole; p-Methoxy-β-methylstyrene; p-Propenylanisole; p-Propenylphenyl methyl ether; Anethol; Anise camphor; Aniskampfer; Isoestragole; Methoxy-4-propenylbenzene; Nauli "gum"; Oil of aniseed; 1-Methoxy-4-(1-propenyl)benzene; 1-Methoxy-4-propenylbenzene; 1-Propene, 1-(4-methoxyphenyl)-; 4-Methoxy-1-propenylbenzene; 4-Methoxypropenylbenzene; 4-Propenylanisole; Propene, 1-(p-methoxyphenyl)-; 1-(p-Methoxyphenyl)propene; Monasirup; Nauli gum; 4-(1-Propenyl)anisole; Benzene, 1-methoxy-4-(1-propen-1-yl)-; NSC 4018; p-Anethole

Condensed phase thermochemistry data

Data compiled by: Hussein Y. Afeefy, Joel F. Liebman, and Stephen E. Stein
Quantity | Value | Units | Method | Reference | Comment |
---|---|---|---|---|---|
ΔcH°liquid | -5544.55 | kJ/mol | Ccb | Swietoslawski and Starczewska, 1928 | Heat of combustion corrected for constant pressure; Corresponding ΔfHºliquid = -105.5 kJ/mol (simple calculation by NIST; no Washburn corrections) |

Phase change data

Data compiled as indicated in comments:
BS - Robert L. Brown and Stephen E. Stein
TRC - Thermodynamics Research Center, NIST Boulder Laboratories, Chris Muzny director
AC - William E. Acree, Jr., James S. Chickos
Quantity | Value | Units | Method | Reference | Comment |
---|---|---|---|---|---|
Tboil | 508. | K | N/A | American Tokyo Kasei, 1988 | BS |
Tboil | 506. | K | N/A | Levy and Dvoleitzska-Gombinska, 1931 | Uncertainty assigned by TRC = 4. K; TRC |
Quantity | Value | Units | Method | Reference | Comment |
Tfus | 295. | K | N/A | Louguinine and Dupont, 1911 | Uncertainty assigned by TRC = 0.5 K; TRC |
Quantity | Value | Units | Method | Reference | Comment |
ΔvapH° | 61.9 | kJ/mol | GC | van Roon, Parsons, et al., 2002 | AC |

Kovats' RI, non-polar column, temperature ramp

Column type | Active phase | I | Reference | Comment |
---|---|---|---|---|
Capillary | SE-54 | 1279. | Rembold, Wallner, et al., 1989 | 30. m/0.25 mm/0.25 μm, He, 0. C @ 12. min, 12. K/min; Tend: 250. C |

Van Den Dool and Kratz RI, non-polar column, temperature ramp

Column type | Active phase | I | Reference | Comment |
---|---|---|---|---|
Capillary | HP-5MS | 1289.3 | Zeng, Zhao, et al., 2007 | 30. m/0.25 mm/0.25 μm, He, 4. K/min; Tstart: 80. C; Tend: 300. C |
Capillary | HP-5MS | 1283.5 | Zhao C.X., Li, et al., 2006 | 30. m/0.25 mm/0.25 μm, He, 4. K/min; Tstart: 80. C; Tend: 300. C |
Capillary | DB-1 | 1264. | Kim, 2001 | 60. m/0.32 mm/1. μm, He, 40. C @ 5. min, 2. K/min; Tend: 220. C |

Van Den Dool and Kratz RI, non-polar column, custom temperature program

Column type | Active phase | I | Reference | Comment |
---|---|---|---|---|
Capillary | SE-54 | 1288. | Zimmermann and Schieberle, 2000 | 30. m/0.25 mm/0.25 μm, He; Program: 35C(2min) => 40C/min => 60C => 6C/min => 180C 20C/min => 240C(10min) |

Van Den Dool and Kratz RI, polar column, temperature ramp

Column type | Active phase | I | Reference | Comment |
---|---|---|---|---|
Capillary | Supelcowax-10 | 1834. | Chung, Yung, et al., 2001 | 60. m/0.25 mm/0.25 μm, He, 35. C @ 5. min, 2. K/min, 195. C @ 90. min |
Capillary | DB-Wax | 1817. | Fröhlich, Duque, et al., 1989 | 30. m/0.25 mm/0.25 μm, He, 50. C @ 3. min, 4. K/min; Tend: 250. C |
Capillary | DB-Wax | 1819. | Fröhlich, Duque, et al., 1989 | 30. m/0.25 mm/0.25 μm, He, 50. C @ 3. min, 4. K/min; Tend: 250. C |

Van Den Dool and Kratz RI, polar column, custom temperature program

Column type | Active phase | I | Reference | Comment |
---|---|---|---|---|
Capillary | FFAP | 1847. | Zimmermann and Schieberle, 2000 | 30. m/0.25 mm/0.25 μm, He; Program: 35C(2min) => 40C/min => 60C => 6C/min => 180C 20C/min => 240C(10min) |

Normal alkane RI, non-polar column, temperature ramp

Column type | Active phase | I | Reference | Comment |
---|---|---|---|---|
Capillary | DB-1 | 1257. | Xu, Tang, et al., 2010 | 30. m/0.25 mm/0.25 μm, Helium, 50. C @ 2. min, 4. K/min, 220. C @ 2. min |
Capillary | HP-5 MS | 1286. | Zhao, Zeng, et al., 2009 | 30. m/0.25 mm/0.25 μm, Helium, 4. K/min; Tstart: 50. C; Tend: 280. C |
Capillary | OV-101 | 1269. | Zenkevich and Kulikova, 1993 | He, 3. K/min; Column length: 54. m; Column diameter: 0.26 mm; Tstart: 50. C; Tend: 230. C |

Normal alkane RI, non-polar column, custom temperature program

Column type | Active phase | I | Reference | Comment |
---|---|---|---|---|
Capillary | OV-1 | 1251. | Chen and Li, 2011 | Helium; Column length: 30. m; Column diameter: 0.25 mm; Program: 40 0C 2 0C/min -> 120 0C 10 0C/min -> 230 0C (15 min) |
Capillary | DB-1 | 1283. | Xu, Tang, et al., 2010 | 30. m/0.25 mm/0.25 μm, Helium; Program: not specified |
Capillary | SE-52 | 1285. | Tognolini, Barocelli, et al., 2006 | 30. m/0.32 mm/0.15 μm, He; Program: 45C => 1C/min => 100C => 5C/min => 250C (10min) |

Normal alkane RI, polar column, temperature ramp

Column type | Active phase | I | Reference | Comment |
---|---|---|---|---|
Capillary | Carbowax | 1809. | Singh, Kumar, et al., 2007 | 60. m/0.25 mm/0.25 μm, He, 5. K/min; Tstart: 40. C; Tend: 180. C |
Capillary | DB-Wax | 1815. | Lee, Umano, et al., 2005 | 30. m/0.25 mm/0.25 μm, He, 3. K/min, 180. C @ 40. min; Tstart: 50. C |

Normal alkane RI, polar column, custom temperature program

Column type | Active phase | I | Reference | Comment |
---|---|---|---|---|
Capillary | Carbowax 20M | 1808. | Saura, LAencina, et al., 2003 | Helium; Column length: 50. m; Column diameter: 0.70 mm; Program: not specified |
Capillary | FFAP | 1822. | Reddy, Angers, et al., 1998 | 25. m/0.2 mm/0.33 μm, H2; Program: 40C(5min) => 4C/min => 170C => 8C/min => 240C (12min) |

References

Swietoslawski and Starczewska, 1928
Swietoslawski, W.; Starczewska, H.,
Influence of certain corrections on the results of measurements of the heat of combustion of organic substances,
Bull. Int. Acad. Pol. Sci. Lett. Cl. Med., 1928, 85-97. [all data]
American Tokyo Kasei, 1988
American Tokyo Kasei,
TCI American Organic Chemical 88/89 Catalog, American Tokyo Kasei, Portland, OR, 1988, 1610. [all data]
Levy and Dvoleitzska-Gombinska, 1931
Levy, J.; Dvoleitzska-Gombinska,
Affinity Capacities and Migration Tendencies XI. Comparison of the Affinity Capacities of Aryl and Alkyl Radicals,
Bull. Soc. Chim. Fr., 1931, 49, 1765-6. [all data]
Louguinine and Dupont, 1911
Louguinine, W.; Dupont, G.,
The heat of fusion of substances which melt at ordinary temperatures.,
Bull. Soc. Chim. Fr., 1911, 9, 219-224. [all data]
van Roon, Parsons, et al., 2002
van Roon, André; Parsons, John R.; Govers, Harrie A.J.,
Gas chromatographic determination of vapour pressure and related thermodynamic properties of monoterpenes and biogenically related compounds,
Journal of Chromatography A, 2002, 955, 1, 105-115, https://doi.org/10.1016/S0021-9673(02)00200-5
. [all data]