Benzene, 1-methoxy-4-propyl-
- Formula: C10H14O
- Molecular weight: 150.2176
- IUPAC Standard InChIKey: KBHWKXNXTURZCD-UHFFFAOYSA-N
- CAS Registry Number: 104-45-0
- Chemical structure:
View 3d structure (requires JavaScript / HTML 5) - Other names: Anisole, p-propyl-; p-Propylanisole; Dihydroanethole; 4-n-Propylanisole; 4-Propylanisole; p-n-Propylanisole; 1-Methoxy-4-propylbenzene; p-Propylmethoxybenzene; Methyl p-propylphenyl ether; p-Propylphenol methyl ether; NSC 37996; propylanisol

Phase change data

Data compiled by: Robert L. Brown and Stephen E. Stein
Quantity | Value | Units | Method | Reference | Comment |
---|---|---|---|---|---|
Tboil | 488. to 489. | K | N/A | Frinton Laboratories Inc., 1986 |

Normal alkane RI, polar column, custom temperature program

Column type | Active phase | I | Reference | Comment |
---|---|---|---|---|
Capillary | Carbowax 20M | 1606. | Vinogradov, 2004 | Program: not specified |
Capillary | Carbowax 20M | 1600. | Shibamoto, 1987 | Program: not specified |

References

Frinton Laboratories Inc., 1986
Frinton Laboratories Inc.,
Catalog Number 11, Frinton Laboratories Inc., Vineland, NJ, 1986, 99. [all data]
Vinogradov, 2004
Vinogradov, B.A.,
Production, composition, properties and application of essential oils, 2004, retrieved from http://viness.narod.ru. [all data]
Shibamoto, 1987
Shibamoto, T.,
Retention Indices in Essential Oil Analysis
in Capillary Gas Chromatography in Essential Oil Analysis, Sandra, P.; Bicchi, C., ed(s)., Hutchig Verlag, Heidelberg, New York, 1987, 259-274. [all data]