p-dodecyltoluene

Phase change data

Data compiled by: Thermodynamics Research Center, NIST Boulder Laboratories, Chris Muzny director

Quantity Value Units Method Reference Comment
Tfus278.2KN/ASchmidt, Schoeller, et al., 1941Uncertainty assigned by TRC = 1. K
Tfus278.KN/ASchmidt and Schoeller, 1941Uncertainty assigned by TRC = 2. K

In addition to the Thermodynamics Research Center (TRC) data available from this site, much more physical and chemical property data is available from the following TRC products:

References

Schmidt, Schoeller, et al., 1941
Schmidt, A.W.; Schoeller, V.; Eberlein, K., Chem. Ber., 1941, 74, 1313. [all data]

Schmidt and Schoeller, 1941
Schmidt, A.W.; Schoeller, V., Physical data of p-alkyl toluenes., Ber. Dtsch. Chem. Ges. A, 1941, 74, 258. [all data]