Oxazole, 2-ethyl-4,5-dihydro-
- Formula: C5H9NO
- Molecular weight: 99.1311
- IUPAC Standard InChIKey: NYEZZYQZRQDLEH-UHFFFAOYSA-N
- CAS Registry Number: 10431-98-8
- Chemical structure:
View 3d structure (requires JavaScript / HTML 5) - Other names: 2-Ethyl-2-oxazoline; 2-Ethyloxazoline; 2-Oxazoline, 2-ethyl-; Oxazoline, 2-ethyl

Gas phase thermochemistry data

Data compiled by: Hussein Y. Afeefy, Joel F. Liebman, and Stephen E. Stein
Quantity | Value | Units | Method | Reference | Comment |
---|---|---|---|---|---|
ΔfH°gas | -148.9 ± 1.2 | kJ/mol | Ccb | Hamilton, Thompson, et al., 1976 |

Condensed phase thermochemistry data

Data compiled by: Hussein Y. Afeefy, Joel F. Liebman, and Stephen E. Stein
Quantity | Value | Units | Method | Reference | Comment |
---|---|---|---|---|---|
ΔfH°liquid | -193.1 ± 1.1 | kJ/mol | Ccb | Hamilton, Thompson, et al., 1976 | |
Quantity | Value | Units | Method | Reference | Comment |
ΔcH°liquid | -3060.6 ± 1.0 | kJ/mol | Ccb | Hamilton, Thompson, et al., 1976 |

Phase change data

Data compiled as indicated in comments:
BS - Robert L. Brown and Stephen E. Stein
ALS - Hussein Y. Afeefy, Joel F. Liebman, and Stephen E. Stein
AC - William E. Acree, Jr., James S. Chickos
Quantity | Value | Units | Method | Reference | Comment |
---|---|---|---|---|---|
Tboil | 401.6 | K | N/A | Aldrich Chemical Company Inc., 1990 | BS |
Quantity | Value | Units | Method | Reference | Comment |
ΔvapH° | 44.22 ± 0.42 | kJ/mol | C | Hamilton, Thompson, et al., 1976 | ALS |
ΔvapH° | 44.2 ± 0.4 | kJ/mol | C | Hamilton, Thompson, et al., 1976 | AC |
Enthalpy of sublimation
ΔsubH (kJ/mol) | Temperature (K) | Reference | Comment |
---|---|---|---|
74.5 | 303. | Aihara, 1953 | Based on data from 293. to 312. K. See also Jones, 1960 and Aihara, 1960.; AC |

Normal alkane RI, non-polar column, temperature ramp

Column type | Active phase | I | Reference | Comment |
---|---|---|---|---|
Capillary | OV-101 | 759. | Zenkevich, 2005 | 25. m/0.20 mm/0.10 μm, N2/He, 6. K/min; Tstart: 50. C; Tend: 250. C |

References

Hamilton, Thompson, et al., 1976
Hamilton, W.S.; Thompson, P.; Pustejovsky, S.,
The enthalpies of combustion and formation of 2-methyl-2-oxazoline and 2-ethyl-2-oxazoline,
J. Chem. Eng. Data, 1976, 21, 428-429. [all data]
Aldrich Chemical Company Inc., 1990
Aldrich Chemical Company Inc.,
Catalog Handbook of Fine Chemicals, Aldrich Chemical Company, Inc., Milwaukee WI, 1990, 1. [all data]
Aihara, 1953
Aihara, A.,
J. Chem. Soc. Jpn. Pure Chem. Sect., 1953, 74, 437. [all data]
Jones, 1960
Jones, A.H.,
Sublimation Pressure Data for Organic Compounds.,
J. Chem. Eng. Data, 1960, 5, 2, 196-200, https://doi.org/10.1021/je60006a019
. [all data]
Aihara, 1960
Aihara, Ariyuki,
Estimation of the Energy of Hydrogen Bonds Formed in Crystals. III. Amides,
Bull. Chem. Soc. Jpn., 1960, 33, 9, 1188-1194, https://doi.org/10.1246/bcsj.33.1188
. [all data]
Zenkevich, 2005
Zenkevich, I.G.,
Experimentally measured retention indices., 2005. [all data]