1,2-Propanediol, 3-(decyloxy)-
- Formula: C13H28O3
- Molecular weight: 232.3596
- IUPAC Standard InChIKey: SHQRLYGZJPBYGJ-UHFFFAOYSA-N
- CAS Registry Number: 10430-97-4
- Chemical structure:
View 3d structure (requires JavaScript / HTML 5) - Other names: Decylmonoglycerinether; 3-(Decyloxy)-1,2-propanediol

Phase change data

Data compiled as indicated in comments:
TRC - Thermodynamics Research Center, NIST Boulder Laboratories, Chris Muzny director
AC - William E. Acree, Jr., James S. Chickos
Quantity | Value | Units | Method | Reference | Comment |
---|---|---|---|---|---|
Tfus | 311. | K | N/A | van Doren and van der Geest, 1990 | Uncertainty assigned by TRC = 2. K; TRC |
Enthalpy of fusion
ΔfusH (kJ/mol) | Temperature (K) | Method | Reference | Comment |
---|---|---|---|---|
38.9 | 311. | DSC | Acree, 1993 | AC |

References

van Doren and van der Geest, 1990
van Doren, H.A.; van der Geest, R.,
A comparative study of the liquid-crystalline behavior of three homologous series of 1,2-propanediol derivatives,
Recl.: J. R. Neth. Chem. Soc., 1990, 109, 197. [all data]
Acree, 1993
Acree, William E.,
Thermodynamic properties of organic compounds,
Thermochimica Acta, 1993, 219, 97-104, https://doi.org/10.1016/0040-6031(93)80486-T
. [all data]