Azelaic acid, 2TBDMS derivative
- Formula: C21H44O4Si2
- Molecular weight: 416.7427
- IUPAC Standard InChIKey: VVOJIMXLEIRYGX-UHFFFAOYSA-N
- CAS Registry Number: 104255-97-2
- Chemical structure:
View 3d structure (requires JavaScript / HTML 5) - Other names: Nonanedioic acid, bis(tert-butyldimethylsilyl) ester; Azelaic acid, bis(tert-butyldimethylsilyl) ester; Azelaic acid, diTBDMS; Nonanedioic acid, bis-TBDMS ester; Bis[tert-butyl(dimethyl)silyl] azelaate; Nonanedioic acid, TBDMS

Van Den Dool and Kratz RI, non-polar column, temperature ramp

Column type | Active phase | I | Reference | Comment |
---|---|---|---|---|
Capillary | DB-5 | 2278. | Ohie, Fu, et al., 2000 | 30. m/0.25 mm/0.25 μm, 100. C @ 1. min, 10. K/min, 300. C @ 15. min |

Van Den Dool and Kratz RI, non-polar column, custom temperature program

Column type | Active phase | I | Reference | Comment |
---|---|---|---|---|
Capillary | VF-5MS | 2263.1 | Tret'yakov, 2008 | 30. m/0.25 mm/0.25 μm, He; Program: Multi-step temperature program; T(initial)=60C; T(final)=270C |

Normal alkane RI, non-polar column, temperature ramp

Column type | Active phase | I | Reference | Comment |
---|---|---|---|---|
Capillary | DB-5 | 2272.47 | Kim, Kim, et al., 1993 | 30. m/0.25 mm/0.241 μm, 4. K/min; Tstart: 60. C; Tend: 280. C |

References

Ohie, Fu, et al., 2000
Ohie, T.; Fu, X.; Iga, M.; Kimura, M.; Yamaguchi, S.,
Gas chromatography-mass spectrometry with tert .-butyldimethylsilyl derivatization: use of the simplified sample preparations and the automated data system to screen for organic acidemias,
J. Chromatogr. B, 2000, 746, 1, 63-73, https://doi.org/10.1016/S0378-4347(00)00105-5
. [all data]
Tret'yakov, 2008
Tret'yakov, K.V.,
Retention Data. NIST Mass Spectrometry Data Center., NIST Mass Spectrometry Data Center, 2008. [all data]
Kim, Kim, et al., 1993
Kim, K.-R.; Kim, J.-H.; Park, H.-K.; Oh, C.-H.,
Dual capillary column system for the qualitative gas chromatography: 2. Comparison between splitless and on-column injection modes,
Bull. Korean Chem. Soc., 1993, 14, 2, 250-255. [all data]