1,2-Diaminopropane
- Formula: C3H10N2
- Molecular weight: 74.1249
- IUPAC Standard InChIKey: AOHJOMMDDJHIJH-UHFFFAOYSA-N
- CAS Registry Number: 10424-38-1
- Chemical structure:
View 3d structure (requires JavaScript / HTML 5) - Species with the same structure:

Gas phase thermochemistry data

Data compiled by: Hussein Y. Afeefy, Joel F. Liebman, and Stephen E. Stein
Quantity | Value | Units | Method | Reference | Comment |
---|---|---|---|---|---|
ΔfH°gas | -53.68 ± 0.46 | kJ/mol | Cm | Messerly, Finke, et al., 1975 | hfusion=4.40±0.01 kcal/mol |

Phase change data

Data compiled as indicated in comments:
BS - Robert L. Brown and Stephen E. Stein
ALS - Hussein Y. Afeefy, Joel F. Liebman, and Stephen E. Stein
Quantity | Value | Units | Method | Reference | Comment |
---|---|---|---|---|---|
Tboil | 392.7 | K | N/A | Weast and Grasselli, 1989 | BS |
Quantity | Value | Units | Method | Reference | Comment |
ΔvapH° | 44.12 ± 0.21 | kJ/mol | V | Messerly, Finke, et al., 1975 | hfusion=4.40±0.01 kcal/mol; ALS |

References

Messerly, Finke, et al., 1975
Messerly, J.F.; Finke, H.L.; Osborn, A.G.; Douslin, D.R.,
Low-temperature calorimetric and vapor-pressure studies on alkanediamines,
J. Chem. Thermodyn., 1975, 7, 1029-10. [all data]
Weast and Grasselli, 1989
CRC Handbook of Data on Organic Compounds, 2nd Editon, Weast,R.C and Grasselli, J.G., ed(s)., CRC Press, Inc., Boca Raton, FL, 1989, 1. [all data]