2-Butanone, 4-(4-methoxyphenyl)-
- Formula: C11H14O2
- Molecular weight: 178.2277
- IUPAC Standard InChIKey: PCBSXBYCASFXTM-UHFFFAOYSA-N
- CAS Registry Number: 104-20-1
- Chemical structure:
View 3d structure (requires JavaScript / HTML 5) - Other names: 2-Butanone, 4-(p-methoxyphenyl)-; Anisylacetone; ENT 20,279; Raspberry ketone methyl ether; 1-(p-Methoxyphenyl)-3-butanone; 1-(4-Methoxyphenyl)-3-butanone; 4-(p-Methoxyphenyl)-2-butanone; 4-(4-Methoxyphenyl)-2-butanone; Anisylacetone, p-; 4-(4-Methoxyphenyl)-butan-2-one; p-Methoxybenzylacetone; 4-Methoxybenzylacetone; NSC 405366; 4-(4-Methoxyphenyl)-2-butanone (anisyl acetone); 1-(4-methoxyphenyl)-3-butanon

Phase change data

Data compiled by: Robert L. Brown and Stephen E. Stein
Reduced pressure boiling point
Tboil (K) | Pressure (bar) | Reference |
---|---|---|
425.7 | 0.020 | Aldrich Chemical Company Inc., 1990 |

Kovats' RI, non-polar column, isothermal

Column type | Active phase | Temperature (C) | I | Reference | Comment |
---|---|---|---|---|---|
Capillary | SE-30 | 150. | 1462. | Tudor and Moldovan, 1999 | |
Capillary | SE-30 | 100. | 1462.0 | Tudor, 1997 | 40. m/0.35 mm/0.35 μm |

Normal alkane RI, non-polar column, custom temperature program

Column type | Active phase | I | Reference | Comment |
---|---|---|---|---|
Capillary | SE-30 | 1473. | Vinogradov, 2004 | Program: not specified |

Normal alkane RI, polar column, custom temperature program

Column type | Active phase | I | Reference | Comment |
---|---|---|---|---|
Capillary | Carbowax 20M | 2236. | Vinogradov, 2004 | Program: not specified |

References

Aldrich Chemical Company Inc., 1990
Aldrich Chemical Company Inc.,
Catalog Handbook of Fine Chemicals, Aldrich Chemical Company, Inc., Milwaukee WI, 1990, 1. [all data]
Tudor and Moldovan, 1999
Tudor, E.; Moldovan, D.,
Temperature Dependence of the Retention Index for Perfumery Compounds on a Se-30 Glass Capillary Column. II. The Hyperbolic Equation,
J. Chromatogr., 1999, 848, 1-2, 215-227, https://doi.org/10.1016/S0021-9673(99)00412-4
. [all data]
Tudor, 1997
Tudor, E.,
Temperature dependence of the retention index for perfumery compounds on a SE-30 glass capillary column. I. Linear equations,
J. Chromatogr. A, 1997, 779, 1-2, 287-297, https://doi.org/10.1016/S0021-9673(97)00453-6
. [all data]
Vinogradov, 2004
Vinogradov, B.A.,
Production, composition, properties and application of essential oils, 2004, retrieved from http://viness.narod.ru. [all data]