1-Piperazineethanamine, N,N,4-trimethyl-
- Formula: C9H21N3
- Molecular weight: 171.2831
- IUPAC Standard InChIKey: XFLSMWXCZBIXLV-UHFFFAOYSA-N
- CAS Registry Number: 104-19-8
- Chemical structure:
View 3d structure (requires JavaScript / HTML 5) - Other names: N-Methyl-N'-(β-dimethylaminoethyl)piperazine; N-Methyl-N'-(dimethylaminoethyl)piperazine; S 36081-3; 1-(2-(Dimethylamino)ethyl)-4-methylpiperazine; 1-(2-(N,N-Dimethylamino)ethyl)-4-methylpiperazine; Piperazine, 1-[2-(dimethylamino)ethyl]-4-methyl-; Kaolizer 8; NSC 79879; Toyocat NP; N,N,4-trimethylpiperazine-1-ethylamine

Phase change data

Data compiled by: Thermodynamics Research Center, NIST Boulder Laboratories, Chris Muzny director
Quantity | Value | Units | Method | Reference | Comment |
---|---|---|---|---|---|
Tfus | 220.3 | K | N/A | Anonymous, 1958 | Uncertainty assigned by TRC = 0.6 K |

References

Anonymous, 1958
Anonymous, R.,
, Am. Pet. Inst. Res. Proj. 45, Ohio State Univ., 1958. [all data]