Ethanimidic acid, N-(trimethylsilyl)-, trimethylsilyl ester
- Formula: C8H21NOSi2
- Molecular weight: 203.4294
- IUPAC Standard InChIKey: SIOVKLKJSOKLIF-UHFFFAOYSA-N
- CAS Registry Number: 10416-59-8
- Chemical structure:
View 3d structure (requires JavaScript / HTML 5) - Other names: Acetimidic acid, N-(trimethylsilyl)-, trimethylsilyl ester; Bis(trimethylsilyl)acetamide; BSA; N,O-Bis(trimethylsilyl)acetamide; N-(Trimethylsilyl)acetimidic acid, trimethylsilyl ester; Dynasylan BSA; Trimethylsilyl N-(trimethylsilyl)ethanimidoate; Acetamide, N,O-bis-trimethylsilyl; trimethylsilyl N-trimethylsilylacetamidate

Phase change data

Data compiled by: Robert L. Brown and Stephen E. Stein
Reduced pressure boiling point
Tboil (K) | Pressure (bar) | Reference |
---|---|---|
345. to 346. | 0.047 | PCR Inc., 1990 |
340.6 | 0.040 | Buckingham and Donaghy, 1982 |
344. to 346. | 0.047 | Buckingham and Donaghy, 1982 |

Normal alkane RI, non-polar column, custom temperature program

Column type | Active phase | I | Reference | Comment |
---|---|---|---|---|
Capillary | Polydimethyl siloxanes | 1008. | Zenkevich, 2001 | Program: not specified |

References

PCR Inc., 1990
PCR Inc.,
Research Chemicals Catalog 1990-1991, PCR Inc., Gainesville, FL, 1990, 1. [all data]
Buckingham and Donaghy, 1982
Buckingham, J.; Donaghy, S.M.,
Dictionary of Organic Compounds: Fifth Edition, Chapman and Hall, New York, 1982, 1. [all data]
Zenkevich, 2001
Zenkevich, I.G.,
Encyclopedia of Chromatography. Derivatization of Hydroxy Compounds for GC Analysis, Marcel Dekker, Inc., New York - Basel, 2001, 237. [all data]