Cyclohexanol, 4-(1,1-dimethylethyl)-, acetate, cis-
- Formula: C12H22O2
- Molecular weight: 198.3019
- IUPAC Standard InChIKey: MBZRJSQZCBXRGK-PHIMTYICSA-N
- CAS Registry Number: 10411-92-4
- Chemical structure:
View 3d structure (requires JavaScript / HTML 5) - Stereoisomers:
- Other names: p-tert-Butyl cyclohexyl-acetate cis; Cyclohexyl, 4-tert-butyl-, acetate (cis-); 4-tert-Butylcyclohexyl acetate, (Z)-; Cyclohexyl, 4-tert-butyl-, acetate (mostly cis-); cis-4-tert-butylcyclohexyl acetate

Normal alkane RI, non-polar column, custom temperature program

Column type | Active phase | I | Reference | Comment |
---|---|---|---|---|
Capillary | SE-30 | 1360. | Vinogradov, 2004 | Program: not specified |

Normal alkane RI, polar column, custom temperature program

Column type | Active phase | I | Reference | Comment |
---|---|---|---|---|
Capillary | Carbowax 20M | 1675. | Vinogradov, 2004 | Program: not specified |

References

Vinogradov, 2004
Vinogradov, B.A.,
Production, composition, properties and application of essential oils, 2004, retrieved from http://viness.narod.ru. [all data]