p-Nitrobenzylidene-p-chlorophenylacetonitrile

Condensed phase thermochemistry data

Data compiled by: Hussein Y. Afeefy, Joel F. Liebman, and Stephen E. Stein

Quantity Value Units Method Reference Comment
Δfsolid  CcbZavoianu, Ciocazanu, et al., 1985uncertain value: 22.82 kcal/mol; Data origin uncertain
Quantity Value Units Method Reference Comment
Δcsolid-1717.9kcal/molCcbZavoianu, Ciocazanu, et al., 1985Data origin uncertain

References

Zavoianu, Ciocazanu, et al., 1985
Zavoianu, D.; Ciocazanu, I.; Moga-Gheorghe, S.; Cuza, O.; Zavoianu, R., Structure and reactivity of nitriles. Heat of combustion and formation of some alpha, beta-unsaturated nitriles derived from p-chlorophenylbenzylideneacetonitrile, Rev. Chim. (Bucharest), 1985, 36, 1099-1101. [all data]