Benzeneacetic acid, 4-methoxy-
- Formula: C9H10O3
- Molecular weight: 166.1739
- IUPAC Standard InChIKey: NRPFNQUDKRYCNX-UHFFFAOYSA-N
- CAS Registry Number: 104-01-8
- Chemical structure:
View 3d structure (requires JavaScript / HTML 5) - Other names: Acetic acid, (p-methoxyphenyl)-; (p-Methoxyphenyl)acetic acid; (4-Methoxyphenyl)acetic acid; Homoanisic acid; 2-(p-Anisyl)acetic acid; 4-Methoxybenzeneacetic acid; MOPA; p-Methoxy-α-toluic acid; NSC 27799; p-Anisylacetic acid

Phase change data

Data compiled as indicated in comments:
BS - Robert L. Brown and Stephen E. Stein
TRC - Thermodynamics Research Center, NIST Boulder Laboratories, Chris Muzny director
AC - William E. Acree, Jr., James S. Chickos
Quantity | Value | Units | Method | Reference | Comment |
---|---|---|---|---|---|
Tfus | 358. | K | N/A | Armstrong, James, et al., 1979 | Uncertainty assigned by TRC = 0.5 K; TRC |
Reduced pressure boiling point
Tboil (K) | Pressure (atm) | Reference | Comment |
---|---|---|---|
413.2 | 0.004 | Aldrich Chemical Company Inc., 1990 | BS |
Enthalpy of fusion
ΔfusH (kcal/mol) | Temperature (K) | Reference | Comment |
---|---|---|---|
5.21 | 358.1 | Acree, 1991 | AC |

Normal alkane RI, non-polar column, temperature ramp

Column type | Active phase | I | Reference | Comment |
---|---|---|---|---|
Capillary | HP-5 MS | 1496. | Jerkovic, Tuberso, et al., 2010 | 30. m/0.25 mm/0.25 μm, Helium, 70. C @ 2. min, 3. K/min, 200. C @ 18. min |

References

Armstrong, James, et al., 1979
Armstrong, N.A.; James, K.C.; Wong, C.K.,
Inter-relationships between solubilities, distribution coefficients and melting points of some substituted benzoic and phenylacetic acids,
J. Pharm. Pharmacol., 1979, 31, 1, 627, https://doi.org/10.1111/j.2042-7158.1979.tb13606.x
. [all data]
Aldrich Chemical Company Inc., 1990
Aldrich Chemical Company Inc.,
Catalog Handbook of Fine Chemicals, Aldrich Chemical Company, Inc., Milwaukee WI, 1990, 1. [all data]
Acree, 1991
Acree, William E.,
Thermodynamic properties of organic compounds: enthalpy of fusion and melting point temperature compilation,
Thermochimica Acta, 1991, 189, 1, 37-56, https://doi.org/10.1016/0040-6031(91)87098-H
. [all data]
Jerkovic, Tuberso, et al., 2010
Jerkovic, I.; Tuberso, C.I.G.; Gugic, M.; Bubalo, D.,
Composition of Sulla (Hedysarum coronarium L.) honey solvent extractives determined by GC/MS: norisoprenoids and other volatile organic compounds,
Molecules, 2010, 15, 9, 6375-6385, https://doi.org/10.3390/molecules15096375
. [all data]