4-Methyl-3-nitrobenzoyl chloride
- Formula: C8H6ClNO3
- Molecular weight: 199.591
- IUPAC Standard InChIKey: DXMHBBURYDVYAI-UHFFFAOYSA-N
- CAS Registry Number: 10397-30-5
- Chemical structure:
View 3d structure (requires JavaScript / HTML 5) - Other names: 3-Nitro-p-toluyl chloride; Benzoyl chloride, 4-methyl-3-nitro-

Phase change data

Data compiled by: Robert L. Brown and Stephen E. Stein
Reduced pressure boiling point
Tboil (K) | Pressure (bar) | Reference |
---|---|---|
433. to 435. | 0.020 | Frinton Laboratories Inc., 1986 |

References

Frinton Laboratories Inc., 1986
Frinton Laboratories Inc.,
Catalog Number 11, Frinton Laboratories Inc., Vineland, NJ, 1986, 99. [all data]