3-(4-Isopropylphenyl)-2-methylpropionaldehyde
- Formula: C13H18O
- Molecular weight: 190.2814
- IUPAC Standard InChIKey: ZFNVDHOSLNRHNN-UHFFFAOYSA-N
- CAS Registry Number: 103-95-7
- Chemical structure:
View 3d structure (requires JavaScript / HTML 5) - Other names: α-Methyl-p-isopropylhydrocinnamic aldehyde; 3-(p-Isopropylphenyl)isobutyraldehyde; Benzenepropanal, α-methyl-4-(1-methylethyl)-; Hydrocinnamaldehyde, p-isopropyl-α-methyl-; Aldehyde B; Cyclamal; Cyclamen aldehyde; p-Isopropyl-α-methylhydrocinnamaldehyde; p-Isopropyl-α-methylhydrocinnamic aldehyde; p-Isopropyl-α-methylphenylpropyl aldehyde; α-Methyl-p-isopropylhydrocinnamaldehyde; 2-Methyl-3-(p-isopropylphenyl)propionaldehyde; β-Methyl-p-iso-propyl phenyl propionaldehyde; 2-Methyl-3-(4-isopropylphenyl)-propanal; 3-(p-Isopropylphenyl)-2-methylpropionaldehyde; 3-p-Cumenyl-2-methylpropionaldehyde; Cymal; 3-(4-Isopropylphenyl)-2-methylpropanal

Phase change data

Data compiled by: William E. Acree, Jr., James S. Chickos
Quantity | Value | Units | Method | Reference | Comment |
---|---|---|---|---|---|
ΔvapH° | 72.6 | kJ/mol | A | Stephenson and Malanowski, 1987 | Based on data from 283. to 499. K. |

Kovats' RI, non-polar column, isothermal

Column type | Active phase | Temperature (C) | I | Reference | Comment |
---|---|---|---|---|---|
Capillary | SE-30 | 100. | 1436.5 | Tudor, 1997 | 40. m/0.35 mm/0.35 μm |

Van Den Dool and Kratz RI, non-polar column, temperature ramp

Column type | Active phase | I | Reference | Comment |
---|---|---|---|---|
Capillary | DB-1 | 1424.1 | Chang, Sheng, et al., 1989 | 2. K/min; Column length: 30. m; Column diameter: 0.25 mm; Tstart: 50. C; Tend: 300. C |
Capillary | DB-1 | 1424.3 | Chang, Sheng, et al., 1989 | 2. K/min; Column length: 30. m; Column diameter: 0.25 mm; Tstart: 50. C; Tend: 300. C |

References

Stephenson and Malanowski, 1987
Stephenson, Richard M.; Malanowski, Stanislaw,
Handbook of the Thermodynamics of Organic Compounds, 1987, https://doi.org/10.1007/978-94-009-3173-2
. [all data]
Tudor, 1997
Tudor, E.,
Temperature dependence of the retention index for perfumery compounds on a SE-30 glass capillary column. I. Linear equations,
J. Chromatogr. A, 1997, 779, 1-2, 287-297, https://doi.org/10.1016/S0021-9673(97)00453-6
. [all data]
Chang, Sheng, et al., 1989
Chang, L.P.; Sheng, L.S.; Yang, M.Z.; An, D.K.,
Retention index of essential oil in temperature-programmed capillary column gas chromatography,
Acta Pharm. Sin., 1989, 24, 11, 847-852. [all data]