Cyclopenta-1,3-dien-2-ol
- Formula: C5H6O
- Molecular weight: 82.1005
- IUPAC Standard InChIKey: BFAIMMGBWGSCPF-UHFFFAOYSA-N
- CAS Registry Number: 103905-54-0
- Chemical structure:
View 3d structure (requires JavaScript / HTML 5) - Other names: 1,4-Cyclopentadien-1-ol

Gas phase thermochemistry data

Data compiled by: Glushko Thermocenter, Russian Academy of Sciences, Moscow
Constant pressure heat capacity of gas
Cp,gas (J/mol*K) | Temperature (K) | Reference | Comment |
---|---|---|---|
39.56 | 100. | Karni M., 1991 | These thermodynamic functions were obtained by ab initio calculations. |
64.68 | 200. | ||
95.02 | 298.15 | ||
95.60 | 300. | ||
124.62 | 400. | ||
148.27 | 500. | ||
166.91 | 600. | ||
181.82 | 700. | ||
194.02 | 800. | ||
204.21 | 900. | ||
212.83 | 1000. | ||
220.19 | 1100. | ||
226.51 | 1200. | ||
231.96 | 1300. | ||
236.67 | 1400. | ||
240.77 | 1500. | ||
244.34 | 1600. | ||
247.46 | 1700. | ||
250.20 | 1800. | ||
252.61 | 1900. | ||
254.75 | 2000. |

References

Karni M., 1991
Karni M.,
Ab initio calculations and ideal gas thermodynamic functions of cyclopentadiene and cyclopentadiene derivatives,
J. Phys. Chem. Ref. Data, 1991, 20, 665-683. [all data]