Cyclopenta-1,3-dien-1-ol
- Formula: C5H6O
- Molecular weight: 82.1005
- IUPAC Standard InChIKey: RAWMWTYCZYEESB-UHFFFAOYSA-N
- CAS Registry Number: 103905-53-9
- Chemical structure:
View 3d structure (requires JavaScript / HTML 5) - Other names: 1,3-Cyclopentadien-1-ol

Gas phase thermochemistry data

Data compiled by: Glushko Thermocenter, Russian Academy of Sciences, Moscow
Constant pressure heat capacity of gas
Cp,gas (J/mol*K) | Temperature (K) | Reference | Comment |
---|---|---|---|
39.33 | 100. | Karni M., 1991 | These thermodynamic functions were obtained by ab initio calculations. |
64.74 | 200. | ||
94.96 | 298.15 | ||
95.53 | 300. | ||
124.43 | 400. | ||
148.06 | 500. | ||
166.72 | 600. | ||
181.65 | 700. | ||
193.88 | 800. | ||
204.08 | 900. | ||
212.72 | 1000. | ||
220.10 | 1100. | ||
226.43 | 1200. | ||
231.88 | 1300. | ||
236.61 | 1400. | ||
240.71 | 1500. | ||
244.28 | 1600. | ||
247.41 | 1700. | ||
250.15 | 1800. | ||
252.57 | 1900. | ||
254.71 | 2000. |

References

Karni M., 1991
Karni M.,
Ab initio calculations and ideal gas thermodynamic functions of cyclopentadiene and cyclopentadiene derivatives,
J. Phys. Chem. Ref. Data, 1991, 20, 665-683. [all data]