Tetrazepam
- Formula: C16H17ClN2O
- Molecular weight: 288.772
- IUPAC Standard InChIKey: IQWYAQCHYZHJOS-UHFFFAOYSA-N
- CAS Registry Number: 10379-14-3
- Chemical structure:
View 3d structure (requires JavaScript / HTML 5) - Other names: 2H-1,4-Benzodiazepin-2-one, 7-chloro-5-(1-cyclohexen-1-yl)-1,3-dihydro-1-methyl-; CB 4261; 4261 CB; 7-Chloro-5-(cyclohexen-1-yl)-1,3-dihydro-1-methyl-2H-1,4-benzodiazepin-2-one; 7-Chloro-5-(1-cyclohexenyl)-1-methyl-2-oxo-2,3-dihydro-1H-(1,4)-benzo(f)diazepine; Clinoxan; Musaril; Myolastan; Ro 06-6657

Kovats' RI, non-polar column, isothermal

Column type | Active phase | Temperature (C) | I | Reference | Comment |
---|---|---|---|---|---|
Capillary | SE-30 | 250. | 2437. | Dimov and Moskovkina, 1991 | |
Capillary | BP-1 | 250. | 2463. | Japp, Garthwaite, et al., 1988 | 25. m/0.22 mm/0.25 μm, N2 |
Capillary | DB-1 | 250. | 2437. | Japp, Garthwaite, et al., 1988 | 30. m/0.53 mm/1.5 μm, N2 |
Packed | SE-30 | 250. | 2460. | Schütz, 1982 | N2 |

Normal alkane RI, non-polar column, temperature ramp

Column type | Active phase | I | Reference | Comment |
---|---|---|---|---|
Capillary | BP-1 | 2463. | MHA, 9999 | Tstart: 100. C; Tend: 300. C |
Packed | SE-30 | 2460. | MHA, 9999 | Nitrogen, Chromosorb G AW DMCS (80-100 mesh); Column length: 2. m; Tstart: 100. C; Tend: 300. C |
Capillary | DB-5 | 2463. | Zamechnik, Ethier, et al., 1989 | 15. m/0.25 mm/0.25 μm, He, 150. C @ 1. min, 10. K/min; Tend: 260. C |

References

Dimov and Moskovkina, 1991
Dimov, N.; Moskovkina, M.,
New aspects of quantitative structure-retention relationships in chromatography,
J. Chromatogr., 1991, 552, 59-69, https://doi.org/10.1016/S0021-9673(01)95923-0
. [all data]
Japp, Garthwaite, et al., 1988
Japp, M.; Garthwaite, K.; Geeson, A.V.; Osselton, M.D.,
Collection of Analytical Data for Benzodiazepines and Benzophenones,
J. Chromatogr., 1988, 439, 2, 317-339, https://doi.org/10.1016/S0021-9673(01)83844-9
. [all data]
Schütz, 1982
Schütz, H.,
Benzodiazepines, Springer-Verlag, New York, 1982, 438. [all data]
MHA, 9999
MHA, Directorate of ForensicScience.,
Forensic Toxicology, 9999. [all data]
Zamechnik, Ethier, et al., 1989
Zamechnik, J.; Ethier, J.-C.; Neville, G.A.,
Benzodiazepines- an extensive collection of mass spectra,
J. Can. Soc. Forensic Sci., 1989, 22, 3, 233-259, https://doi.org/10.1080/00085030.1989.10757437
. [all data]