Nortetrazepam
- Formula: C15H15ClN2O
- Molecular weight: 274.745
- IUPAC Standard InChIKey: FDRMSENAXZDFTN-UHFFFAOYSA-N
- CAS Registry Number: 10379-11-0
- Chemical structure:
View 3d structure (requires JavaScript / HTML 5) - Other names: 7-Chloro-5-(1-cyclohexen-1-yl)-1,3-dihydro-2H-1,4-benzodiazepin-2-one; CB-4260

Kovats' RI, non-polar column, isothermal

Column type | Active phase | Temperature (C) | I | Reference | Comment |
---|---|---|---|---|---|
Packed | SE-30 | 250. | 2520. | Schütz, 1982 | N2 |

References

Schütz, 1982
Schütz, H.,
Benzodiazepines, Springer-Verlag, New York, 1982, 438. [all data]