lithium sulphate
- Formula: Li2O4S
- Molecular weight: 109.945
- CAS Registry Number: 10377-48-7

Gas phase thermochemistry data

Quantity | Value | Units | Method | Reference | Comment |
---|---|---|---|---|---|
ΔfH°gas | -1041.82 | kJ/mol | Review | Chase, 1998 | Data last reviewed in December, 1978 |
Quantity | Value | Units | Method | Reference | Comment |
S°gas,1 bar | 322.81 | J/mol*K | Review | Chase, 1998 | Data last reviewed in December, 1978 |
Gas Phase Heat Capacity (Shomate Equation)
Cp° = A + B*t + C*t2 + D*t3 +
E/t2
H° − H°298.15= A*t + B*t2/2 +
C*t3/3 + D*t4/4 − E/t + F − H
S° = A*ln(t) + B*t + C*t2/2 + D*t3/3 −
E/(2*t2) + G
Cp = heat capacity (J/mol*K)
H° = standard enthalpy (kJ/mol)
S° = standard entropy (J/mol*K)
t = temperature (K) / 1000.
View plot Requires a JavaScript / HTML 5 canvas capable browser.
Temperature (K) | 3000. to 6000. |
---|---|
A | 156.8703 |
B | 0.617274 |
C | -0.125008 |
D | 0.008661 |
E | -8.872424 |
F | -1113.722 |
G | 474.5828 |
H | -1041.816 |
Reference | Chase, 1998 |
Comment | Data last reviewed in December, 1978 |

Reaction thermochemistry data

Data compiled by: José A. Martinho Simões
Individual Reactions
C2H5LiO (cr) + 0.5( • 1100
) (solution) = 0.5Li2O4S (solution) +
(solution)
By formula: C2H5LiO (cr) + 0.5(H2O4S • 1100H2O) (solution) = 0.5Li2O4S (solution) + C2H6O (solution)
Quantity | Value | Units | Method | Reference | Comment |
---|---|---|---|---|---|
ΔrH° | -113.6 ± 1.3 | kJ/mol | RSC | Blanchard, Joly, et al., 1974 | solvent: Sulphuric acid aqueous solution; The reaction enthalpy relies on -10.6 kJ/mol for the enthalpy of solution of EtOH(l) and on -17.5±0.3 for the enthalpy of solution of Li2SO4(cr) Blanchard, Joly, et al., 1974. |

Condensed phase thermochemistry data

Quantity Value Units Method Reference Comment
Δfliquid-1399.30kJ/molReviewChase, 1998Data last reviewed in December, 1978
Quantity Value Units Method Reference Comment
liquid,1 bar154.24J/mol*KReviewChase, 1998Data last reviewed in December, 1978
Quantity Value Units Method Reference Comment
Δfsolid-1436.37kJ/molReviewChase, 1998α phase; Data last reviewed in December, 1978

Liquid Phase Heat Capacity (Shomate Equation)

Cp° = A + B*t + C*t2 + D*t3 + E/t2
H° − H°298.15= A*t + B*t2/2 + C*t3/3 + D*t4/4 − E/t + F − H
S° = A*ln(t) + B*t + C*t2/2 + D*t3/3 − E/(2*t2) + G
    Cp = heat capacity (J/mol*K)
    H° = standard enthalpy (kJ/mol)
    S° = standard entropy (J/mol*K)
    t = temperature (K) / 1000.

View plot Requires a JavaScript / HTML 5 canvas capable browser.

View table.

Temperature (K) 1132. - 3000.
A 205.0160
B -4.033794×10-8
C 1.851940×10-8
D -2.810235×10-9
E -5.071804×10-9
F -1480.810
G 355.0329
H -1399.297
ReferenceChase, 1998
Comment Data last reviewed in December, 1978

Solid Phase Heat Capacity (Shomate Equation)

Cp° = A + B*t + C*t2 + D*t3 + E/t2
H° − H°298.15= A*t + B*t2/2 + C*t3/3 + D*t4/4 − E/t + F − H
S° = A*ln(t) + B*t + C*t2/2 + D*t3/3 − E/(2*t2) + G
    Cp = heat capacity (J/mol*K)
    H° = standard enthalpy (kJ/mol)
    S° = standard entropy (J/mol*K)
    t = temperature (K) / 1000.

View plot Requires a JavaScript / HTML 5 canvas capable browser.

View table.

Temperature (K) 298. - 1132.298. - 1132.
A 130.4203265.6924
B 25.11396-65.24822
C 104.219327.94092
D -33.70869-3.824558
E -2.550089-10.54548
F -1485.814-1537.478
G 245.5196393.6952
H -1436.367-1425.376
ReferenceChase, 1998Chase, 1998
Comment α phase; Data last reviewed in December, 1978 β phase; Data last reviewed in December, 1978

References

Chase, 1998
Chase, M.W., Jr.,
NIST-JANAF Themochemical Tables, Fourth Edition,
J. Phys. Chem. Ref. Data, Monograph 9, 1998, 1-1951. [all data]
Blanchard, Joly, et al., 1974
Blanchard, J.M.; Joly, R.D.; Lettoffe, J.M.; Perachon, G.; Thourey, J.,
J. Chim. Phys. Phys.-Chim. Biol., 1974, 71, 472. [all data]