7-Tetradecene
- Formula: C14H28
- Molecular weight: 196.3721
- IUPAC Standard InChIKey: UBDIXSAEHLOROW-UHFFFAOYSA-N
- CAS Registry Number: 10374-74-0
- Chemical structure:
View 3d structure (requires JavaScript / HTML 5) - Stereoisomers:
- Other names: 7-Tetradecene,c&t; Tetradec-7-ene

Kovats' RI, non-polar column, isothermal

Column type | Active phase | Temperature (C) | I | Reference | Comment |
---|---|---|---|---|---|
Capillary | Squalane | 100. | 1367. | Sojak, Hrivnak, et al., 1973 | |
Capillary | Squalane | 130. | 1370. | Sojak, Hrivnak, et al., 1973 |

References

Sojak, Hrivnak, et al., 1973
Sojak, L.; Hrivnak, J.; Majer, P.; Janak, J.,
Capillary Gas Chromatography of Linear Alkenes on Squalane,
Anal. Chem., 1973, 45, 2, 293-302, https://doi.org/10.1021/ac60324a039
. [all data]