Benzenamine, N-ethyl-
- Formula: C8H11N
- Molecular weight: 121.1796
- IUPAC Standard InChIKey: OJGMBLNIHDZDGS-UHFFFAOYSA-N
- CAS Registry Number: 103-69-5
- Chemical structure:
View 3d structure (requires JavaScript / HTML 5) - Other names: Aniline, N-ethyl-; Anilinoethane; Ethylaniline; Ethylphenylamine; N-Ethyl-N-phenylamine; N-Ethylaminobenzene; N-Ethylaniline; N-Ethylbenzenamine; Aethylanilin; UN 2272; NSC 8736; N-EthylaniIine

Gas phase thermochemistry data

Data compiled as indicated in comments:
ALS - Hussein Y. Afeefy, Joel F. Liebman, and Stephen E. Stein
DRB - Donald R. Burgess, Jr.
Quantity | Value | Units | Method | Reference | Comment |
---|---|---|---|---|---|
ΔfH°gas | 56.1 | kJ/mol | Ccb | Vriens and Hill, 1952 | ALS |
ΔfH°gas | 23.1 | kJ/mol | N/A | Lemoult, 1907 | Value computed using ΔfHliquid° value of -29.0 kj/mol from Lemoult, 1907 and ΔvapH° value of 52.1 kj/mol from Vriens and Hill, 1952.; DRB |
Quantity | Value | Units | Method | Reference | Comment |
ΔcH°gas | -4714.9 | kJ/mol | Ccb | Lemoult, 1907 | ALS |

Condensed phase thermochemistry data

Data compiled by: Hussein Y. Afeefy, Joel F. Liebman, and Stephen E. Stein
Quantity | Value | Units | Method | Reference | Comment |
---|---|---|---|---|---|
ΔfH°liquid | 4. | kJ/mol | Ccb | Vriens and Hill, 1952 | |
ΔfH°liquid | -29. | kJ/mol | Ccb | Lemoult, 1907 | |
Quantity | Value | Units | Method | Reference | Comment |
ΔcH°liquid | -4724.2 ± 4.2 | kJ/mol | Ccb | Vriens and Hill, 1952 | Reanalyzed by Cox and Pilcher, 1970, Original value = -4727.1 kJ/mol |

Phase change data

Data compiled as indicated in comments:
BS - Robert L. Brown and Stephen E. Stein
TRC - Thermodynamics Research Center, NIST Boulder Laboratories, Chris Muzny director
AC - William E. Acree, Jr., James S. Chickos
ALS - Hussein Y. Afeefy, Joel F. Liebman, and Stephen E. Stein
DRB - Donald R. Burgess, Jr.
Quantity | Value | Units | Method | Reference | Comment |
---|---|---|---|---|---|
Tboil | 479. ± 1. | K | AVG | N/A | Average of 9 values; Individual data points |
Quantity | Value | Units | Method | Reference | Comment |
Tfus | 209.65 | K | N/A | Timmermans, 1914 | Uncertainty assigned by TRC = 0.4 K; TRC |
Quantity | Value | Units | Method | Reference | Comment |
ΔvapH° | 58.3 ± 0.6 | kJ/mol | N/A | Verevkin, 1997 | Based on data from 279. to 318. K.; AC |
ΔvapH° | 52.3 | kJ/mol | V | Vriens and Hill, 1952 | ALS |
ΔvapH° | 52.1 | kJ/mol | N/A | Vriens and Hill, 1952 | DRB |
Enthalpy of vaporization
ΔvapH (kJ/mol) | Temperature (K) | Method | Reference | Comment |
---|---|---|---|---|
52.2 | 326. | A | Stephenson and Malanowski, 1987 | Based on data from 311. to 477. K.; AC |
Antoine Equation Parameters
log10(P) = A − (B / (T + C))
P = vapor pressure (bar)
T = temperature (K)
View plot Requires a JavaScript / HTML 5 canvas capable browser.
Temperature (K) | A | B | C | Reference | Comment |
---|---|---|---|---|---|
323. to 479.9 | 5.64275 | 2809.017 | 20.856 | Nelson and Wales, 1925 | Coefficents calculated by NIST from author's data. |

Reaction thermochemistry data

Data compiled as indicated in comments:
B - John E. Bartmess
ALS - Hussein Y. Afeefy, Joel F. Liebman, and Stephen E. Stein
Individual Reactions
C8H10N- + =
By formula: C8H10N- + H+ = C8H11N
Quantity | Value | Units | Method | Reference | Comment |
---|---|---|---|---|---|
ΔrH° | 1523. ± 8.8 | kJ/mol | G+TS | Taft, 1987 | gas phase; value altered from reference due to change in acidity scale; B |
Quantity | Value | Units | Method | Reference | Comment |
ΔrG° | 1493. ± 8.4 | kJ/mol | IMRE | Taft, 1987 | gas phase; value altered from reference due to change in acidity scale; B |
By formula: C8H11N + HNO2 = C8H10N2O + H2O
Quantity | Value | Units | Method | Reference | Comment |
---|---|---|---|---|---|
ΔrH° | -78.83 | kJ/mol | Cm | Swientoslawski, 1910 | liquid phase; ALS |

Gas phase ion energetics data

Data evaluated as indicated in comments:
HL - Edward P. Hunter and Sharon G. Lias
Data compiled as indicated in comments:
B - John E. Bartmess
LBLHLM - Sharon G. Lias, John E. Bartmess, Joel F. Liebman, John L. Holmes, Rhoda D. Levin, and W. Gary Mallard
RDSH - Henry M. Rosenstock, Keith Draxl, Bruce W. Steiner, and John T. Herron
Quantity | Value | Units | Method | Reference | Comment |
---|---|---|---|---|---|
Proton affinity (review) | 924.8 | kJ/mol | N/A | Hunter and Lias, 1998 | HL |
Quantity | Value | Units | Method | Reference | Comment |
Gas basicity | 892.9 | kJ/mol | N/A | Hunter and Lias, 1998 | HL |
Ionization energy determinations
IE (eV) | Method | Reference | Comment |
---|---|---|---|
7.56 | CTS | Farrell and Newton, 1965 | RDSH |
7.5 | CTS | Briegleb and Czekalla, 1959 | RDSH |
7.67 ± 0.06 | PE | Rozeboom, Houk, et al., 1982 | Vertical value; LBLHLM |
De-protonation reactions
C8H10N- + =
By formula: C8H10N- + H+ = C8H11N
Quantity | Value | Units | Method | Reference | Comment |
---|---|---|---|---|---|
ΔrH° | 1523. ± 8.8 | kJ/mol | G+TS | Taft, 1987 | gas phase; value altered from reference due to change in acidity scale; B |
Quantity | Value | Units | Method | Reference | Comment |
ΔrG° | 1493. ± 8.4 | kJ/mol | IMRE | Taft, 1987 | gas phase; value altered from reference due to change in acidity scale; B |

Van Den Dool and Kratz RI, non-polar column, temperature ramp

Data compiled by: NIST Mass Spectrometry Data Center, William E. Wallace, director

Column type CapillaryPacked
Active phase OV-1SE-30
Column length (m)  3.05
Carrier gas  He
Substrate  Supelcoport and Chromosorb
Column diameter (mm)
Phase thickness (μm)
Tstart (C) 35.40.
Tend (C) 300.250.
Heat rate (K/min) 8.10.
Initial hold (min)  4.
Final hold (min)  60.
I 1100.1125.
ReferenceGautzsch and Zinn, 1996Peng, Ding, et al., 1988
Comment MSDC-RI MSDC-RI

Normal alkane RI, polar column, custom temperature program

Data compiled by: NIST Mass Spectrometry Data Center, William E. Wallace, director

Column type Capillary
Active phase DB-Wax
Column length (m)
Carrier gas
Substrate
Column diameter (mm)
Phase thickness (μm)
Program not specified
I 1761.
ReferencePeng, Yang, et al., 1991
Comment MSDC-RI

Kovats' RI, polar column, isothermal

View large format table.

Column type Active phase Temperature (C) I Reference Comment
PackedCarbowax 20M165.1740.9Ellis and Still, 1979Chromosorb W, AW-DMCS
PackedPEG-2000179.1748.Anderson, Jurel, et al., 1973He, Celite 545 (44-60 mesh); Column length: 3. m
PackedPEG-2000180.1738.Anderson, Jurel, et al., 1973He, Celite 545 (44-60 mesh); Column length: 3. m
PackedPEG-2000200.1750.Anderson, Jurel, et al., 1973He, Celite 545 (44-60 mesh); Column length: 3. m
PackedPEG-2000200.1751.Anderson, Jurel, et al., 1973He, Celite 545 (44-60 mesh); Column length: 3. m

Van Den Dool and Kratz RI, non-polar column, custom temperature program

View large format table.

Column type Active phase I Reference Comment
Capillary5 % Phenyl methyl siloxane1128.Yasuhara, Shiraishi, et al., 199725. m/0.31 mm/0.52 μm, He; Program: 50C(2min) => (20C/min) => 120C => (7C/min) => 310C(10min)

Normal alkane RI, non-polar column, temperature ramp

View large format table.

Column type Active phase I Reference Comment
CapillarySE-301111.5Bur'yan and Nabivach, 19921.7 K/min; Tstart: 82. C; Tend: 177. C
CapillaryUltra-11100.Okumura, 199125. m/0.32 mm/0.25 μm, He, 3. K/min; Tstart: 80. C; Tend: 260. C

References

Vriens and Hill, 1952
Vriens, G.N.; Hill, A.G.,
Equilibria of several reactions of aromatic amines,
Ind. Eng. Chem., 1952, 44, 2732-27. [all data]
Lemoult, 1907
Lemoult, M.P.,
Recherches theoriques et experimentales sur les chaleurs de combustion et de formation des composes organiques,
Ann. Chim. Phys., 1907, 12, 395-432. [all data]
Cox and Pilcher, 1970
Cox, J.D.; Pilcher, G.,
Thermochemistry of Organic and Organometallic Compounds, Academic Press, New York, 1970, 1-636. [all data]
Timmermans, 1914
Timmermans, J.,
Freezing temperature of organic compounds. II.,
Bull. Soc. Chim. Belg., 1914, 27, 334. [all data]
Verevkin, 1997
Verevkin, Sergey P.,
Thermochemistry of amines: experimental standard molar enthalpies of formation of some aliphatic and aromatic amines,
The Journal of Chemical Thermodynamics, 1997, 29, 8, 891-899, https://doi.org/10.1006/jcht.1997.0212
. [all data]
Stephenson and Malanowski, 1987
Stephenson, Richard M.; Malanowski, Stanislaw,
Handbook of the Thermodynamics of Organic Compounds, 1987, https://doi.org/10.1007/978-94-009-3173-2
. [all data]
Nelson and Wales, 1925
Nelson, O.A.; Wales, H.,
Vapor Pressures and Boiling Points of Mono- and Dimthylanilines and Mono- and Diethylanilines,
J. Am. Chem. Soc., 1925, 47, 3, 867-872, https://doi.org/10.1021/ja01680a040
. [all data]
Taft, 1987
Taft, R.W.,
The Nature and Analysis of Substitutent Electronic Effects,
Personal communication. See also Prog. Phys. Org. Chem., 1987, 16, 1. [all data]
Swientoslawski, 1910
Swientoslawski, W.,
Thermochemische Untersuchungen der organischen Verbindungen. Dritte Mitteilung. Stickstoffhaltige Verbindungen.,
Z. Phys. Chem., 1910, 72, 49-83. [all data]