benzene-1,3,5-tricarbonitrile
- Formula: C9H3N3
- Molecular weight: 153.1402
- IUPAC Standard InChIKey: SGLGUTWNGVJXPP-UHFFFAOYSA-N
- CAS Registry Number: 10365-94-3
- Chemical structure:
View 3d structure (requires JavaScript / HTML 5) - Other names: 1,3,5-Tricyanobenzene

Gas phase thermochemistry data

Quantity | Value | Units | Method | Reference | Comment |
---|---|---|---|---|---|
ΔfH°gas | 509.6 | kJ/mol | Semi | Stewart, 2004 |

Gas phase ion energetics data

Data compiled by: John E. Bartmess
Electron affinity determinations
EA (eV) | Method | Reference | Comment |
---|---|---|---|
1.840 ± 0.015 | LPES | Tsukuda, Kondow, et al., 1997 |

References

Stewart, 2004
Stewart, J.J.P.,
Comparison of the accuracy of semiempirical and some DFT methods for predicting heats of formation,
J. Mol. Model, 2004, 10, 1, 6-10, https://doi.org/10.1007/s00894-003-0157-6
. [all data]
Tsukuda, Kondow, et al., 1997
Tsukuda, T.; Kondow, T.; Dessent, C.E.H.; Bailey, C.G.; Johnson, M.A.; Hendricks, J.H.; Lyapustina, S.S.; Bowe,
Characterization of the Anionic Intracluster Polymerization Reaction Product of 2-Chloroacrylonitrile Trimers by Photoelectron Spectroscopy,
Chem. Phys. Lett., 1997, 269, 1-2, 17, https://doi.org/10.1016/S0009-2614(97)00255-8
. [all data]