LaO3 radical

Gas phase ion energetics data

Data compiled by: John E. Bartmess

Electron affinity determinations

EA (eV) Method Reference Comment
0.30 ± 0.50LPESKlingeler, Luttgens, et al., 1999

References

Klingeler, Luttgens, et al., 1999
Klingeler, R.; Luttgens, G.; Pontius, N.; Rochow, R.; Bechthold, P.S.; Neeb, M.; Eberhardt, W., Photoelectron spectra of small LaOn- clusters: decreasing electron affinity upon increasing the number of oxygen atoms, Eur. Phys. J. D, 1999, 9, 1, 263-267, https://doi.org/10.1007/s100530050437 . [all data]