Heptane, 3-[(ethenyloxy)methyl]-
- Formula: C10H20O
- Molecular weight: 156.2652
- IUPAC Standard InChIKey: DSSAWHFZNWVJEC-UHFFFAOYSA-N
- CAS Registry Number: 103-44-6
- Chemical structure:
View 3d structure (requires JavaScript / HTML 5) - Other names: Ether, 2-ethylhexyl vinyl; Vinyl 2-ethylhexyl ether; 1-Ethenoxy-2-ethylhexane; 2-Ethylhexyl vinyl ether; Rapi-cure EHVE; (2-Ethyl-1-hexyl) vinyl ether

Phase change data

Data compiled by: William E. Acree, Jr., James S. Chickos
Enthalpy of vaporization
ΔvapH (kJ/mol) | Temperature (K) | Method | Reference | Comment |
---|---|---|---|---|
44.7 | 345. | A | Stephenson and Malanowski, 1987 | Based on data from 330. to 451. K. |

Kovats' RI, non-polar column, isothermal

Column type | Active phase | Temperature (C) | I | Reference | Comment |
---|---|---|---|---|---|
Packed | SE-30 | 120. | 1036. | García-Raso, Martínez-Castro, et al., 1987 | N2, Supelcoport; Column length: 3. m |
Packed | Apiezon L | 120. | 1011. | Bogoslovsky, Anvaer, et al., 1978 | Celite 545 |
Packed | Apiezon L | 160. | 1026. | Bogoslovsky, Anvaer, et al., 1978 | Celite 545 |

Kovats' RI, polar column, isothermal

Column type | Active phase | Temperature (C) | I | Reference | Comment |
---|---|---|---|---|---|
Capillary | Carbowax 20M | 120. | 1179. | García-Raso, Martínez-Castro, et al., 1987 | N2, Supelcoport; Column length: 25. m; Column diameter: 0.22 mm |

Normal alkane RI, non-polar column, custom temperature program

Column type | Active phase | I | Reference | Comment |
---|---|---|---|---|
Capillary | SE-30 | 1038. | Vinogradov, 2004 | Program: not specified |

Normal alkane RI, polar column, custom temperature program

Column type | Active phase | I | Reference | Comment |
---|---|---|---|---|
Capillary | Carbowax 20M | 1165. | Vinogradov, 2004 | Program: not specified |
Capillary | DB-Wax | 1168. | Peng, Yang, et al., 1991 | Program: not specified |

References

Stephenson and Malanowski, 1987
Stephenson, Richard M.; Malanowski, Stanislaw,
Handbook of the Thermodynamics of Organic Compounds, 1987, https://doi.org/10.1007/978-94-009-3173-2
. [all data]
García-Raso, Martínez-Castro, et al., 1987
García-Raso, A.; Martínez-Castro, I.; Páez, M.I.; Sanz, J.; García-Raso, J.; Saura-Calixto, F.,
Gas Chromatographic Behaviour of Carbohydrate Trimethylsilyl Ethers. I. Aldopentoses,
J. Chromatogr., 1987, 398, 9-20, https://doi.org/10.1016/S0021-9673(01)96491-X
. [all data]
Bogoslovsky, Anvaer, et al., 1978
Bogoslovsky, Yu.N.; Anvaer, B.I.; Vigdergauz, M.S.,
Chromatographic constants in gas chromatography (in Russian), Standards Publ. House, Moscow, 1978, 192. [all data]
Vinogradov, 2004
Vinogradov, B.A.,
Production, composition, properties and application of essential oils, 2004, retrieved from http://viness.narod.ru. [all data]
Peng, Yang, et al., 1991
Peng, C.T.; Yang, Z.C.; Ding, S.F.,
Prediction of rentention idexes. II. Structure-retention index relationship on polar columns,
J. Chromatogr., 1991, 586, 1, 85-112, https://doi.org/10.1016/0021-9673(91)80028-F
. [all data]