Quinoline, decahydro-, cis-
- Formula: C9H17N
- Molecular weight: 139.2380
- IUPAC Standard InChIKey: POTIYWUALSJREP-RKDXNWHRSA-N
- CAS Registry Number: 10343-99-4
- Chemical structure:
View 3d structure (requires JavaScript / HTML 5) - Stereoisomers:
- Other names: cis-Decahydroquinoline; Decahydroquinoline, (Z)-

Phase change data

Data compiled by: Robert L. Brown and Stephen E. Stein
Reduced pressure boiling point
Tboil (K) | Pressure (bar) | Reference |
---|---|---|
363.2 | 0.027 | Weast and Grasselli, 1989 |

References

Weast and Grasselli, 1989
CRC Handbook of Data on Organic Compounds, 2nd Editon, Weast,R.C and Grasselli, J.G., ed(s)., CRC Press, Inc., Boca Raton, FL, 1989, 1. [all data]