Benzene, 1-(chloromethyl)-2,4,5-trimethyl-
- Formula: C10H13Cl
- Molecular weight: 168.663
- IUPAC Standard InChIKey: YHMFTAUOYLECGZ-UHFFFAOYSA-N
- CAS Registry Number: 10340-77-9
- Chemical structure:
View 3d structure (requires JavaScript / HTML 5) - Other names: 1,2,4-Trimethyl-5-(chloromethyl)benzene

Normal alkane RI, non-polar column, temperature ramp

Column type | Active phase | I | Reference | Comment |
---|---|---|---|---|
Capillary | OV-101 | 1335. | Zenkevich and Makarov, 2007 | N2, 6. K/min; Column length: 25. m; Column diameter: 0.2 mm; Tstart: 60. C; Tend: 240. C |
Capillary | OV-101 | 1319. | Zenkevich, 2001 | N2, 4. K/min; Column length: 25. m; Column diameter: 0.20 mm; Tstart: 60. C; Tend: 240. C |

References

Zenkevich and Makarov, 2007
Zenkevich, I.G.; Makarov, A.A.,
Identification of Alkylarene Chloromethylation Products Using Gas-Chromatographic Retention Indices,
Russian Journal of General Chemistry, 2007, 77, 4, 611-619, https://doi.org/10.1134/S1070363207040196
. [all data]
Zenkevich, 2001
Zenkevich, I.G.,
Interpretation of Gas Chromatographic Retention Indices in estimation of Structures of Isomeric Products of Radical Chlorinating of Alkyl Arenes,
Zh. Org. Khim., 2001, 37, 2, 283-293. [all data]