3-Nonen-1-ol, (Z)-
- Formula: C9H18O
- Molecular weight: 142.2386
- IUPAC Standard InChIKey: IFTBJDZSLBRRMC-SREVYHEPSA-N
- CAS Registry Number: 10340-23-5
- Chemical structure:
View 3d structure (requires JavaScript / HTML 5) - Stereoisomers:
- Other names: cis-3-Nonen-1-Ol; (3Z)-3-Nonen-1-ol; (Z)-3-Nonen-1-ol; (Z)-Non-3-en-1-ol

Phase change data

Data compiled by: Robert L. Brown and Stephen E. Stein
Reduced pressure boiling point
Tboil (K) | Pressure (bar) | Reference |
---|---|---|
381.2 | 0.027 | Aldrich Chemical Company Inc., 1990 |

Van Den Dool and Kratz RI, non-polar column, temperature ramp

Column type | Active phase | I | Reference | Comment |
---|---|---|---|---|
Capillary | HP-5MS | 1152.8 | Zhao C.X., Li, et al., 2006 | 30. m/0.25 mm/0.25 μm, He, 4. K/min; Tstart: 80. C; Tend: 300. C |
Capillary | HP-5MS | 1156. | Kim, Shin, et al., 2001 | 30. m/0.25 mm/0.25 μm, He, 40. C @ 5. min, 2. K/min, 200. C @ 20. min |

Van Den Dool and Kratz RI, non-polar column, custom temperature program

Column type | Active phase | I | Reference | Comment |
---|---|---|---|---|
Capillary | VF-5MS | 1160. | Tret'yakov, 2008 | 30. m/0.25 mm/0.25 μm, He; Program: Multi-step temperature program; T(initial)=60C; T(final)=270C |

Van Den Dool and Kratz RI, polar column, temperature ramp

Column type | Active phase | I | Reference | Comment |
---|---|---|---|---|
Capillary | CP-Wax 52CB | 1682. | Kourkoutas, Elmore, et al., 2006 | 60. m/0.25 mm/0.25 μm, He, 4. K/min; Tstart: 40. C; Tend: 250. C |
Capillary | DB-Wax | 1682. | Hayata, Sakamoto, et al., 2003 | He, 40. C @ 10. min, 3. K/min, 220. C @ 30. min; Column length: 60. m; Column diameter: 0.25 mm |
Capillary | DB-Wax | 1682. | Kim, Shin, et al., 2001 | 30. m/0.25 mm/0.25 μm, He, 40. C @ 5. min, 2. K/min, 200. C @ 20. min |

Normal alkane RI, non-polar column, temperature ramp

Column type | Active phase | I | Reference | Comment |
---|---|---|---|---|
Capillary | Optima-5 | 1150. | Al-Qudah, Muhaidat, et al., 2012 | 30. m/0.25 mm/0.25 μm, Helium, 60. C @ 1. min, 3. K/min; Tend: 246. C |
Capillary | HP-101 | 1143. | Jerkovic, Mastelic, et al., 2007 | 25. m/0.2 mm/0.2 μm, He, 70. C @ 2. min, 3. K/min; Tend: 200. C |
Capillary | DB-1 | 1134. | Flath, Mon, et al., 1983 | 50. C @ 0.1 min, 4. K/min, 250. C @ 5. min; Column length: 60. m; Column diameter: 0.32 mm |

Normal alkane RI, non-polar column, custom temperature program

Column type | Active phase | I | Reference | Comment |
---|---|---|---|---|
Capillary | 5 % Phenyl methyl siloxane | 1158. | Beaulieu J.C. and Lea J.M., 2006 | 30. m/0.25 mm/0.75 μm; Program: 50C(1min) => 5C/min => 100C => 10C/min => 190C => 30C/min => 250C(1min) |
Capillary | HP-5 | 1126. | Jordán, Shaw, et al., 2001 | 30. m/0.25 mm/0.25 μm; Program: 40C (6min) => 2.5C/min => 150C => 90C/min => 250C |

Normal alkane RI, polar column, temperature ramp

Column type | Active phase | I | Reference | Comment |
---|---|---|---|---|
Capillary | DB-Wax | 1682. | Hayata, Sakamoto, et al., 2002 | 60. m/0.25 mm/0.25 μm, He, 40. C @ 10. min, 3. K/min, 220. C @ 10. min |
Capillary | Supelcowax-10 | 1693. | Wong and Lai, 1996 | 60. m/0.25 mm/0.25 μm, He, 40. C @ 3. min, 3. K/min, 200. C @ 30. min |

Normal alkane RI, polar column, custom temperature program

Column type | Active phase | I | Reference | Comment |
---|---|---|---|---|
Capillary | DB-Wax | 1688. | Canuti, Conversano, et al., 2009 | 30. m/0.25 mm/0.25 μm, Helium; Program: 40 0C (4 min) 2.5 0C/min -> 80 0C 5 0C/min -> 110 0C 10 0C/min -> 220 0C (5 min) |
Capillary | DB-Wax | 1664. | Canuti, Conversano, et al., 2009 | 30. m/0.25 mm/0.25 μm, Helium; Program: not specified |

References

Aldrich Chemical Company Inc., 1990
Aldrich Chemical Company Inc.,
Catalog Handbook of Fine Chemicals, Aldrich Chemical Company, Inc., Milwaukee WI, 1990, 1. [all data]
Zhao C.X., Li, et al., 2006
Zhao C.X.; Li, X.N.; Liang Y.Z.; Fang H.Z.; Huang L.F.; Guo F.Q.,
Comparative analysis of chemical components of essential oils from different samples of Rhododendron with the help of chemometrics methods,
Chemom. Intell. Lab. Syst., 2006, 82, 1-2, 218-228, https://doi.org/10.1016/j.chemolab.2005.08.008
. [all data]
Kim, Shin, et al., 2001
Kim, T.H.; Shin, J.H.; Baek, H.H.; Lee, H.J.,
Volatile flavour compounds in suspension culture of Agastache rugosa Kuntze (Korean mint),
J. Sci. Food Agric., 2001, 81, 6, 569-575, https://doi.org/10.1002/jsfa.845
. [all data]
Tret'yakov, 2008
Tret'yakov, K.V.,
Retention Data. NIST Mass Spectrometry Data Center., NIST Mass Spectrometry Data Center, 2008. [all data]
Kourkoutas, Elmore, et al., 2006
Kourkoutas, D.; Elmore, J.S.; Mottram, D.S.,
Comparison of the volatile compositions and flavour properties of cantaloupe, Galia and honeydew muskmelons,
Food Chem., 2006, 97, 1, 95-102, https://doi.org/10.1016/j.foodchem.2005.03.026
. [all data]
Hayata, Sakamoto, et al., 2003
Hayata, Y.; Sakamoto, T.; Maneerat, C.; Li, X.; Kozuka, H.; Sakamoto, K.,
Evaluation of aroma compounds contributing to muskmelon flavor in Porapak Q extracts by aroma extract dilution analysis,
J. Agric. Food Chem., 2003, 51, 11, 3415-3418, https://doi.org/10.1021/jf0209950
. [all data]
Al-Qudah, Muhaidat, et al., 2012
Al-Qudah, M.A.; Muhaidat, R.; Trawenh, I.N.; Jaber, H.I.; Abu Zarga, M.H.; Abu Orabi, S.T.,
Volatile constituents of leaves and bulbs of Gynandriris Sisyrinchicum and their antimicrobial activities,
Jordan J. Chem., 2012, 7, 3, 287-295. [all data]
Jerkovic, Mastelic, et al., 2007
Jerkovic, I.; Mastelic, J.; Marijanovic, Z.,
Bound volatile compounds and essential oil from the fruit of Maclura pomifera (Raf.) Schneid. (osage orange),
Flavour Fragr. J., 2007, 22, 1, 84-88, https://doi.org/10.1002/ffj.1763
. [all data]
Flath, Mon, et al., 1983
Flath, R.A.; Mon, T.R.; Lorenz, G.; Whitten, C.J.; Mackley, J.W.,
Volatile components of Acacia sp. blossoms,
J. Agric. Food Chem., 1983, 31, 6, 1167-1170, https://doi.org/10.1021/jf00120a008
. [all data]
Beaulieu J.C. and Lea J.M., 2006
Beaulieu J.C.; Lea J.M.,
Characterization and semiquantitative analysis of volatiles in seedless watermelon varieties using solid-phase microextraction,
J. Agric. Food Chem., 2006, 54, 20, 7789-7793, https://doi.org/10.1021/jf060663l
. [all data]
Jordán, Shaw, et al., 2001
Jordán, M.J.; Shaw, P.E.; Goodner, K.L.,
Volatile components in aqueous essence and fresh fruit of Cucumis melo cv. Athena (muskmelon) by GC-MS and GC-O,
J. Agric. Food Chem., 2001, 49, 12, 5929-5933, https://doi.org/10.1021/jf010954o
. [all data]
Hayata, Sakamoto, et al., 2002
Hayata, Y.; Sakamoto, T.; Kozuka, H.; Sakamoto, K.; Osajima, Y.,
Analysis of aromatic volatile compounds in 'Miyabi' melon (Cucumis melo L.) using the Porapak Q column,
J. Jpn. Soc. Hortic. Sci., 2002, 71, 4, 517-525, https://doi.org/10.2503/jjshs.71.517
. [all data]
Wong and Lai, 1996
Wong, K.C.; Lai, F.Y.,
Volatile constituents from the fruits of four Syzygium species grown in Malaysia,
Flavour Fragr. J., 1996, 11, 1, 61-66, https://doi.org/10.1002/(SICI)1099-1026(199601)11:1<61::AID-FFJ539>3.0.CO;2-1
. [all data]
Canuti, Conversano, et al., 2009
Canuti, V.; Conversano, M.; Li Calzi, M.; Heymann, H.; Matthews, M.A.; Ebeler, S.E.,
Headspace solid-phase microextraction - gas chromatography - mass spectrometry for profiling free volatile compounds in Cabernet Sauvignon grapes and vines,
J. Chromatogr. A., 2009, 1216, 15, 3012-3022, https://doi.org/10.1016/j.chroma.2009.01.104
. [all data]