Benzenemethanamine, N-phenyl-
- Formula: C13H13N
- Molecular weight: 183.2490
- IUPAC Standard InChIKey: GTWJETSWSUWSEJ-UHFFFAOYSA-N
- CAS Registry Number: 103-32-2
- Chemical structure:
View 3d structure (requires JavaScript / HTML 5) - Other names: Benzylamine, N-phenyl-; Aniline, N-benzyl-; Benzenamine, N-(phenylmethyl)-; Benzylaniline; Benzylphenylamine; N-Benzylaniline; N-Monobenzylaniline; N-Phenylbenzylamine; Phenylbenzylamine; N-Phenylbenzenemethanamine; NSC 147284

Phase change data

Data compiled as indicated in comments:
BS - Robert L. Brown and Stephen E. Stein
TRC - Thermodynamics Research Center, NIST Boulder Laboratories, Chris Muzny director
AC - William E. Acree, Jr., James S. Chickos
Quantity | Value | Units | Method | Reference | Comment |
---|---|---|---|---|---|
Tboil | 579.7 | K | N/A | Weast and Grasselli, 1989 | BS |
Tboil | 579. to 580. | K | N/A | Buckingham and Donaghy, 1982 | BS |
Quantity | Value | Units | Method | Reference | Comment |
Tfus | 310. to 312. | K | N/A | Buckingham and Donaghy, 1982 | BS |
Tfus | 310. | K | N/A | Tammann, 1913 | Uncertainty assigned by TRC = 1. K; TRC |
Tfus | 305.15 | K | N/A | Perkin, 1896 | Uncertainty assigned by TRC = 0.5 K; TRC |
Reduced pressure boiling point
Tboil (K) | Pressure (bar) | Reference | Comment |
---|---|---|---|
475.2 | 0.049 | Weast and Grasselli, 1989 | BS |
474. to 476. | 0.049 | Buckingham and Donaghy, 1982 | BS |
Enthalpy of vaporization
ΔvapH (kJ/mol) | Temperature (K) | Reference | Comment |
---|---|---|---|
79.6 ± 1.1 | 330. | Verevkin, 1997 | Based on data from 316. to 343. K.; AC |
Enthalpy of sublimation
ΔsubH (kJ/mol) | Temperature (K) | Method | Reference | Comment |
---|---|---|---|---|
103.6 ± 1.6 | 303. | T | Verevkin, 1997 | Based on data from 293. to 312. K.; AC |
Enthalpy of fusion
ΔfusH (kJ/mol) | Temperature (K) | Reference | Comment |
---|---|---|---|
16.76 | 305.6 | Acree, 1991 | AC |

References

Weast and Grasselli, 1989
CRC Handbook of Data on Organic Compounds, 2nd Editon, Weast,R.C and Grasselli, J.G., ed(s)., CRC Press, Inc., Boca Raton, FL, 1989, 1. [all data]
Buckingham and Donaghy, 1982
Buckingham, J.; Donaghy, S.M.,
Dictionary of Organic Compounds: Fifth Edition, Chapman and Hall, New York, 1982, 1. [all data]
Tammann, 1913
Tammann, G.,
Nachr. Ges. Wiss. Goettingen, Math.-Phys. Kl., 1913, 1913, 335. [all data]
Perkin, 1896
Perkin, W.H.,
LXIX. On Magnetic Rotatory Power, especially of Aromatic Compounds,
J. Chem. Soc., 1896, 69, 1025-1257. [all data]
Verevkin, 1997
Verevkin, Sergey P.,
Thermochemistry of amines: experimental standard molar enthalpies of formation of some aliphatic and aromatic amines,
The Journal of Chemical Thermodynamics, 1997, 29, 8, 891-899, https://doi.org/10.1006/jcht.1997.0212
. [all data]
Acree, 1991
Acree, William E.,
Thermodynamic properties of organic compounds: enthalpy of fusion and melting point temperature compilation,
Thermochimica Acta, 1991, 189, 1, 37-56, https://doi.org/10.1016/0040-6031(91)87098-H
. [all data]