d-Arabinose
- Formula: C5H10O5
- Molecular weight: 150.1299
- IUPAC Standard InChIKey: PYMYPHUHKUWMLA-WDCZJNDASA-N
- CAS Registry Number: 10323-20-3
- Chemical structure:
View 3d structure (requires JavaScript / HTML 5) - Stereoisomers:
- Comments:
- Although only a single structure is shown, this species may exist in several forms including a linear molecule, a five membered ring and a six membered ring.

Condensed phase thermochemistry data

Data compiled by: Hussein Y. Afeefy, Joel F. Liebman, and Stephen E. Stein
Quantity | Value | Units | Method | Reference | Comment |
---|---|---|---|---|---|
ΔfH°solid | -1057.9 ± 1.6 | kJ/mol | Ccb | Desai and Wilhoit, 1970 | |
Quantity | Value | Units | Method | Reference | Comment |
ΔcH°solid | -2338.8 ± 1.6 | kJ/mol | Ccb | Desai and Wilhoit, 1970 | Corresponding ΔfHºsolid = -1057.9 kJ/mol (simple calculation by NIST; no Washburn corrections) |
ΔcH°solid | -2336.2 | kJ/mol | Ccb | Stroh and Fincke, 1963 | Corresponding ΔfHºsolid = -1060.5 kJ/mol (simple calculation by NIST; no Washburn corrections) |

Reaction thermochemistry data

Data compiled by: Hussein Y. Afeefy, Joel F. Liebman, and Stephen E. Stein
Individual Reactions
By formula: C5H10O5 = C5H10O5
Quantity | Value | Units | Method | Reference | Comment |
---|---|---|---|---|---|
ΔrH° | -20.8 ± 3.4 | kJ/mol | Ciso | Tewari and Goldberg, 1985 | solid phase; solvent: Water |
By formula: C5H10O5 = C5H10O5
Quantity | Value | Units | Method | Reference | Comment |
---|---|---|---|---|---|
ΔrH° | -9.8 ± 3.0 | kJ/mol | Ciso | Tewari and Goldberg, 1985 | solid phase; solvent: Water |

References

Desai and Wilhoit, 1970
Desai, P.; Wilhoit, R.C.,
Heats of combustion and enthalpies of formation of D-ribose, D-arabinose, and L-ascorbic acid,
Thermochim. Acta, 1970, 1, 61-64. [all data]
Stroh and Fincke, 1963
Stroh, H.H.; Fincke, C.R.,
Beobachtung ciner unterschidlichen hydrierbarkeit von n-substituiertten aziridin-derivaten,
Z. Chem., 1963, 3, 265-266. [all data]
Tewari and Goldberg, 1985
Tewari, Y.B.; Goldberg, R.N.,
An investigation of the equilibria between aqueous ribose, ribulose, and arabinose,
Biophys. Chem., 1985, 22, 197-204. [all data]