Hexanedioic acid, bis(2-ethylhexyl) ester
- Formula: C22H42O4
- Molecular weight: 370.5665
- IUPAC Standard InChIKey: SAOKZLXYCUGLFA-UHFFFAOYSA-N
- CAS Registry Number: 103-23-1
- Chemical structure:
View 3d structure (requires JavaScript / HTML 5) - Other names: Adipic acid, bis(2-ethylhexyl) ester; Adipol 2EH; Bis(2-ethylhexyl) adipate; Bisoflex DOA; Di(2-ethylhexyl) adipate; DOA; Effomoll DOA; Flexol A 26; Kodaflex DOA; Monoplex DOA; Plastomoll DOA; Sicol 250; Truflex DOA; Vestinol OA; Wickenol 158; WITAMOL 320; Adipic acid di(2-ethylhexyl) ester; NCI-C54386; BEHA; Bis-(2-ethylhexyl)ester kyseliny adipove; DEHA; Ergoplast Addo; Flexol plasticizer 10-A; Flexol plasticizer A-26; Kemester 5652; Mollan S; PX-238; Reomol DOA; Rucoflex plasticizer doa; Staflex doa; Uniflex doa; Diethylhexyl adipate; Lankroflex DOA; Adimoll DO; Bis-(2-ethylhexyl)ester kyseliny adipove (czech); Bis(2-ethylhexyl) hexanedioate; Dioctyl adipate; Good-rite GP-223; Jayflex DOA 2; Monsanto DOA; Palatinol DOA; Plasthall DOA; Polycizer DOA; Sansocizer DOA; Hexanedioic acid, 1,6-bis(2-ethylhexyl) ester; K 3220; Hatcol 2908; Crodamol DOA; ADO (lubricating oil); 39393-67-4; 63637-48-9; 70147-21-6

Condensed phase thermochemistry data

Data compiled by: Eugene S. Domalski and Elizabeth D. Hearing
Quantity | Value | Units | Method | Reference | Comment |
---|---|---|---|---|---|
S°liquid | 865. | J/mol*K | N/A | Ovchinnikov, Moseeva, et al., 1985 |
Constant pressure heat capacity of liquid
Cp,liquid (J/mol*K) | Temperature (K) | Reference | Comment |
---|---|---|---|
701.5 | 300. | Ovchinnikov, Moseeva, et al., 1985 | T = 6 to 300 K. |

Phase change data

Data compiled as indicated in comments:
BS - Robert L. Brown and Stephen E. Stein
DH - Eugene S. Domalski and Elizabeth D. Hearing
Quantity | Value | Units | Method | Reference | Comment |
---|---|---|---|---|---|
Tfus | 161.5 | K | N/A | Ovchinnikov, Moseeva, et al., 1985 | Glass transition.; DH |
Reduced pressure boiling point
Tboil (K) | Pressure (bar) | Reference | Comment |
---|---|---|---|
440.2 | 0.001 | Aldrich Chemical Company Inc., 1990 | BS |

Kovats' RI, non-polar column, custom temperature program

Column type | Active phase | I | Reference | Comment |
---|---|---|---|---|
Packed | SE-30 | 2383. | Ramsey, Lee, et al., 1980 | He, Chromosorb G HP (80-100 mesh); Column length: 1.5 m; Program: not specified |
Packed | SE-30 | 2381. | Ramsey, Lee, et al., 1980 | He, Chromosorb G HP (80-100 mesh); Column length: 1.5 m; Program: not specified |

Van Den Dool and Kratz RI, non-polar column, temperature ramp

Column type | Active phase | I | Reference | Comment |
---|---|---|---|---|
Packed | SE-30 | 2382. | Helaimia and Messadi, 1989 | Chromosorb Q, 10. K/min; Column length: 2. m; Tstart: 100. C |
Packed | SE-30 | 2390. | Helaimia and Messadi, 1989 | Chromosorb Q, 10. K/min; Column length: 2. m; Tstart: 100. C |
Packed | SE-30 | 2382. | Messadi and Vergnaud, 1979 | N2, Chromosorb Q, 10. K/min; Tstart: 100. C; Tend: 340. C |

Van Den Dool and Kratz RI, non-polar column, custom temperature program

Column type | Active phase | I | Reference | Comment |
---|---|---|---|---|
Capillary | HP-5MS | 2398.2 | Andriamaharavo, 2014 | 30. m/0.25 mm/0.25 μm, He; Program: 60C (1 min) => 5 C/min => 210C => 10 C/min => 280C (15 min) |

Normal alkane RI, non-polar column, temperature ramp

Column type | Active phase | I | Reference | Comment |
---|---|---|---|---|
Capillary | Ultra-1 | 2361. | Okumura, 1991 | 25. m/0.32 mm/0.25 μm, He, 3. K/min; Tstart: 80. C; Tend: 260. C |

Normal alkane RI, non-polar column, custom temperature program

Column type | Active phase | I | Reference | Comment |
---|---|---|---|---|
Capillary | Polydimethyl siloxanes | 2381. | Schutz and Wollrab A., 1988 | Program: not specified |
Other | Methyl Silicone | 2381. | Ardrey and Moffat, 1981 | Program: not specified |
Other | Methyl Silicone | 2383. | Ardrey and Moffat, 1981 | Program: not specified |

Normal alkane RI, polar column, temperature ramp

Column type | Active phase | I | Reference | Comment |
---|---|---|---|---|
Capillary | HP-Innowax | 1892. | Feng, Zhuang, et al., 2011 | 60. m/0.25 mm/0.25 μm, Helium, 60. C @ 1. min, 3. K/min, 220. C @ 5. min |

Normal alkane RI, polar column, custom temperature program

Column type | Active phase | I | Reference | Comment |
---|---|---|---|---|
Capillary | HP-Innowax | 1896. | Feng, Zhuang, et al., 2011 | 60. m/0.25 mm/0.25 μm, Helium; Program: not specified |

References

Ovchinnikov, Moseeva, et al., 1985
Ovchinnikov, E.Yu.; Moseeva, E.M.; Rabinovich, I.B.,
Thermodynamic properties of di(2-ethylhexyl) adipate,
Zhur. Fiz. Khim., 1985, 59, 2836-2837. [all data]
Aldrich Chemical Company Inc., 1990
Aldrich Chemical Company Inc.,
Catalog Handbook of Fine Chemicals, Aldrich Chemical Company, Inc., Milwaukee WI, 1990, 1. [all data]
Ramsey, Lee, et al., 1980
Ramsey, J.D.; Lee, T.D.; Osselton, M.D.; Moffat, A.C.,
Gas-liquid chromatographic retention indices of 296 non-drug substances on SE-30 or OV-1 likely to be encountered in toxicological analyses,
J. Chromatogr., 1980, 184, 2, 185-206, https://doi.org/10.1016/S0021-9673(00)85641-1
. [all data]
Helaimia and Messadi, 1989
Helaimia, F.; Messadi, D.,
Determination of linear programmed temperature gas chromatography retention indices for some plasticizers,
C.R. Acad. Sci. Ser. 2:, 1989, 309, 37-42. [all data]
Messadi and Vergnaud, 1979
Messadi, D.; Vergnaud, J.-M.,
Quick identification and analysis of plasticizers in PVC by programmed-temperature gas chromatography using the best stationary phases,
J. Appl. Polym. Sci., 1979, 24, 5, 1215-1225, https://doi.org/10.1002/app.1979.070240507
. [all data]
Andriamaharavo, 2014
Andriamaharavo, N.R.,
Retention Data. NIST Mass Spectrometry Data Center., NIST Mass Spectrometry Data Center, 2014. [all data]
Okumura, 1991
Okumura, T.,
retention indices of environmental chemicals on methyl silicone capillary column,
Journal of Environmental Chemistry (Japan), 1991, 1, 2, 333-358, https://doi.org/10.5985/jec.1.333
. [all data]
Schutz and Wollrab A., 1988
Schutz, H.; Wollrab A.,
The significance of the retention index in toxicologic analysis II,
Pharmazie in unzerer Zeit, 1988, 17, 4, 97-101. [all data]
Ardrey and Moffat, 1981
Ardrey, R.E.; Moffat, A.C.,
Gas-liquid chromatographic retention indices of 1318 substances of toxicological interest on SE-30 or OV-1 stationary phase,
J. Chromatogr., 1981, 220, 3, 195-252, https://doi.org/10.1016/S0021-9673(00)81925-1
. [all data]
Feng, Zhuang, et al., 2011
Feng, T.; Zhuang, H.; Ye, R.; Jin, Z.; Xu, X.; Xie, Z.,
Analysis of volatile compounds of Mesona Blumes gum/rice extrudates via GC-MS and electronic nose,
Sensors and Actuators B: Chemical, 2011, 160, 1, 964-973, https://doi.org/10.1016/j.snb.2011.09.013
. [all data]