4-Undecanol, 7-ethyl-2-methyl-
- Formula: C14H30O
- Molecular weight: 214.3874
- IUPAC Standard InChIKey: JKKBSZCOVNFRCQ-UHFFFAOYSA-N
- CAS Registry Number: 103-20-8
- Chemical structure:
View 3d structure (requires JavaScript / HTML 5) - Other names: 7-Ethyl-2-methyl-4-undecanol; 2-Methyl-7-ethyl-4-undecanol; 7-Ethyl-2-methyl-4-hendecanol; 7-ethyl-2-methylundecan-4-ol

Phase change data

Data compiled by: Thermodynamics Research Center, NIST Boulder Laboratories, Chris Muzny director
Quantity | Value | Units | Method | Reference | Comment |
---|---|---|---|---|---|
Tboil | 537.45 | K | N/A | Anonymous, 1958 | |
Tboil | 533.15 | K | N/A | Othmer, Savitt, et al., 1949 |

References

Anonymous, 1958
Anonymous, X.,
Am. Pet. Inst. Res. Proj. 50, 1958, Unpublished, 1958. [all data]
Othmer, Savitt, et al., 1949
Othmer, D.F.; Savitt, S.A.; Krasner, A.; Goldberg, A.M.; Markowitz, D.,
Composition of vapors from boiling binary solutions. Systems with m- or p-cresol as one component.,
Ind. Eng. Chem., 1949, 41, 572. [all data]