Chlorbenside
- Formula: C13H10Cl2S
- Molecular weight: 269.189
- IUPAC Standard InChIKey: ZHLKXBJTJHRTTE-UHFFFAOYSA-N
- CAS Registry Number: 103-17-3
- Chemical structure:
View 3d structure (requires JavaScript / HTML 5) - Other names: Benzene, 1-chloro-4-[[(4-chlorophenyl)methyl]thio]-; Sulfide, p-chlorobenzyl p-chlorophenyl; p-Chlorobenzyl p-chlorophenyl sulfide; p-Chlorobenzyl p-chlorophenyl sulphide; Chloracid; Chlorbensid (German); Chlorbenzide; Chlorocid; Chlorparacide; Chlorsulphacide; CP 20; Mitox; 4-Chlorobenzyl 4-Chlorophenyl sulfide; (4-Chloor-benzyl)-(4-chloor-fenyl)-sulfide; (4-Chlor-benzyl)-(4-chlor-phenyl)-sulfid; (4-Cloro-benzil)-(4-cloro-fenil)-solfuro; p,p'-Dichlorodiphenyl sulfide; Chloorbenzide; Chlorbensid; Chlorbenxide; Chlorocide; Chloroparacide; Chlorosulfacide; ENT 20,696; HRS 860; RD 2195; Sulfure de 4-chlorobenzyle et de 4-chlorophenyle; 1-Chloro-4-(((4-chlorophenyl)methyl)thio)benzene; 4-Chlorobenzyl 4-chlorophenyl sulphide; 4-Chlorophenyl 4'-chlorobenzyl sulfide; Chlorobenside; NSC 33078

Phase change data

Data compiled as indicated in comments:
TRC - Thermodynamics Research Center, NIST Boulder Laboratories, Chris Muzny director
AC - William E. Acree, Jr., James S. Chickos
CAL - James S. Chickos, William E. Acree, Jr., Joel F. Liebman, Students of Chem 202 (Introduction to the Literature of Chemistry), University of Missouri -- St. Louis
Quantity | Value | Units | Method | Reference | Comment |
---|---|---|---|---|---|
Tfus | 343.8 | K | N/A | Plato and Glasgow, 1969 | Uncertainty assigned by TRC = 0.2 K; TRC |
Tfus | 344.5 | K | N/A | Plato and Glasgow, 1969 | Uncertainty assigned by TRC = 0.2 K; TRC |
Enthalpy of fusion
ΔfusH (kJ/mol) | Temperature (K) | Method | Reference | Comment |
---|---|---|---|---|
32.22 | 343.8 | DSC | Plato and Glasgow, 1969, 2 | AC |
Entropy of fusion
ΔfusS (J/mol*K) | Temperature (K) | Reference | Comment |
---|---|---|---|
96.55 | 343.8 | Plato and Glasgow, 1969 | CAL |

Kovats' RI, non-polar column, custom temperature program

Column type | Active phase | I | Reference | Comment |
---|---|---|---|---|
Packed | SE-30 | 2040. | Ramsey, Lee, et al., 1980 | He, Chromosorb G HP (80-100 mesh); Column length: 1.5 m; Program: not specified |

Normal alkane RI, non-polar column, custom temperature program

Column type | Active phase | I | Reference | Comment |
---|---|---|---|---|
Other | Methyl Silicone | 2045. | Ardrey and Moffat, 1981 | Program: not specified |

References

Plato and Glasgow, 1969
Plato, C.; Glasgow, A.R., Jr.,
Differential scanning calorimetry as a general method for determining the purity and heat of fusion of high-purity organic chemicals. Application to 95 compounds,
Anal. Chem., 1969, 41, 2, 330, https://doi.org/10.1021/ac60271a041
. [all data]
Plato and Glasgow, 1969, 2
Plato, Candace.; Glasgow, Augustus R.,
Differential scanning calorimetry as a general method for determining the purity and heat of fusion of high-purity organic chemicals. Application to 95 compounds,
Anal. Chem., 1969, 41, 2, 330-336, https://doi.org/10.1021/ac60271a041
. [all data]
Ramsey, Lee, et al., 1980
Ramsey, J.D.; Lee, T.D.; Osselton, M.D.; Moffat, A.C.,
Gas-liquid chromatographic retention indices of 296 non-drug substances on SE-30 or OV-1 likely to be encountered in toxicological analyses,
J. Chromatogr., 1980, 184, 2, 185-206, https://doi.org/10.1016/S0021-9673(00)85641-1
. [all data]
Ardrey and Moffat, 1981
Ardrey, R.E.; Moffat, A.C.,
Gas-liquid chromatographic retention indices of 1318 substances of toxicological interest on SE-30 or OV-1 stationary phase,
J. Chromatogr., 1981, 220, 3, 195-252, https://doi.org/10.1016/S0021-9673(00)81925-1
. [all data]