Cyclopentanemethanol, 1-amino-
- Formula: C6H13NO
- Molecular weight: 115.1735
- IUPAC Standard InChIKey: PDNZJLMPXLQDPL-UHFFFAOYSA-N
- CAS Registry Number: 10316-79-7
- Chemical structure:
View 3d structure (requires JavaScript / HTML 5) - Other names: 1-Aminocyclopentanemethanol; Amino-1 methylol-1 cyclopentane; 1-Amino-1-cyclopentanemethanol

Phase change data

Data compiled by: Robert L. Brown and Stephen E. Stein
Quantity | Value | Units | Method | Reference | Comment |
---|---|---|---|---|---|
Tfus | 431. to 432. | K | N/A | Buckingham and Donaghy, 1982 |
Reduced pressure boiling point
Tboil (K) | Pressure (bar) | Reference |
---|---|---|
360.2 | 0.013 | Weast and Grasselli, 1989 |
341. to 342. | 0.001 | Buckingham and Donaghy, 1982 |

References

Buckingham and Donaghy, 1982
Buckingham, J.; Donaghy, S.M.,
Dictionary of Organic Compounds: Fifth Edition, Chapman and Hall, New York, 1982, 1. [all data]
Weast and Grasselli, 1989
CRC Handbook of Data on Organic Compounds, 2nd Editon, Weast,R.C and Grasselli, J.G., ed(s)., CRC Press, Inc., Boca Raton, FL, 1989, 1. [all data]