Acetaldehyde, methoxy-
- Formula: C3H6O2
- Molecular weight: 74.0785
- IUPAC Standard InChIKey: YSEFYOVWKJXNCH-UHFFFAOYSA-N
- CAS Registry Number: 10312-83-1
- Chemical structure:
View 3d structure (requires JavaScript / HTML 5) - Other names: Methoxyacetaldehyde; Acetaldehyde, 2-methoxy-; α-Methoxyacetaldehyde; 2-Methoxyacetaldehyde; Methoxyethanal

Phase change data

Data compiled by: Thermodynamics Research Center, NIST Boulder Laboratories, Chris Muzny director
Quantity | Value | Units | Method | Reference | Comment |
---|---|---|---|---|---|
Tboil | 365.5 | K | N/A | Drake, Duvall, et al., 1938 | Uncertainty assigned by TRC = 0.5 K |

References

Drake, Duvall, et al., 1938
Drake, N.L.; Duvall, H.M.; Jacobs, T.L.; Thompson, H.T.; Sonnichsen, H.M.,
Two alkoxyacetaldehydes, their preparation and properties,
J. Am. Chem. Soc., 1938, 60, 73. [all data]