Benzenepropanol, α,α-dimethyl-
- Formula: C11H16O
- Molecular weight: 164.2441
- IUPAC Standard InChIKey: YXVSKJDFNJFXAJ-UHFFFAOYSA-N
- CAS Registry Number: 103-05-9
- Chemical structure:
View 3d structure (requires JavaScript / HTML 5) - Other names: 1-Propanol, 1,1-dimethyl-3-phenyl-; Benzyl-tert-butanol; Dimethylphenethylcarbinol; Dimethylphenylethylcarbinol; Phenylethyl dimethyl carbinol; 2-(2-Phenylethyl)-2-propanol; 2-Butanol, 2-methyl-4-phenyl-; 2-Methyl-4-phenyl-2-butanol; α,α-Dimethyl-γ-phenylpropyl alcohol; 1,1-Dimethyl-3-phenyl-1-propanol; 1,1-Dimethyl-3-phenylpropanol; Benzyl-t-butanol; 1,1-Dimethyl-3-phenylpropyl alcohol; 1-Phenyl-3-methylbutan-3-ol; 2-Phenethyl-2-propanol; NSC 62145; 2-methyl-4-phenylbutan-2-ol

Phase change data

Data compiled by: Robert L. Brown and Stephen E. Stein
Reduced pressure boiling point
Tboil (K) | Pressure (bar) | Reference |
---|---|---|
417.2 | 0.11 | Aldrich Chemical Company Inc., 1990 |

Kovats' RI, non-polar column, isothermal

Column type | Active phase | Temperature (C) | I | Reference | Comment |
---|---|---|---|---|---|
Capillary | SE-30 | 100. | 1270.5 | Tudor, 1997 | 40. m/0.35 mm/0.35 μm |

Normal alkane RI, non-polar column, temperature ramp

Column type | Active phase | I | Reference | Comment |
---|---|---|---|---|
Capillary | OV-101 | 1282. | Egolf and Jurs, 1993 | 2. K/min; Column length: 50. m; Column diameter: 0.22 mm; Tstart: 80. C; Tend: 200. C |

Normal alkane RI, polar column, temperature ramp

Column type | Active phase | I | Reference | Comment |
---|---|---|---|---|
Capillary | Carbowax 20M | 1916. | Egolf and Jurs, 1993 | 2. K/min; Column length: 80. m; Column diameter: 0.2 mm; Tstart: 70. C; Tend: 170. C |

References

Aldrich Chemical Company Inc., 1990
Aldrich Chemical Company Inc.,
Catalog Handbook of Fine Chemicals, Aldrich Chemical Company, Inc., Milwaukee WI, 1990, 1. [all data]
Tudor, 1997
Tudor, E.,
Temperature dependence of the retention index for perfumery compounds on a SE-30 glass capillary column. I. Linear equations,
J. Chromatogr. A, 1997, 779, 1-2, 287-297, https://doi.org/10.1016/S0021-9673(97)00453-6
. [all data]
Egolf and Jurs, 1993
Egolf, L.M.; Jurs, P.C.,
Quantitative structure-retention and structure-odor intensity relationships for a diverse group of odor-active compounds,
Anal. Chem., 1993, 65, 21, 3119-3126, https://doi.org/10.1021/ac00069a027
. [all data]