2-Propanone, phenylhydrazone
- Formula: C9H12N2
- Molecular weight: 148.2050
- IUPAC Standard InChIKey: JQLKSEQEILIJEG-UHFFFAOYSA-N
- CAS Registry Number: 103-02-6
- Chemical structure:
View 3d structure (requires JavaScript / HTML 5) - Other names: Acetone phenylhydrazone; N-Isopropylidene-N'-phenylhydrazine

Condensed phase thermochemistry data

Data compiled by: Hussein Y. Afeefy, Joel F. Liebman, and Stephen E. Stein
Quantity | Value | Units | Method | Reference | Comment |
---|---|---|---|---|---|
ΔfH°liquid | -161.3 | kJ/mol | Cm | Landrieu, 1905 | Author's hf298_condensed[kcal/mol]=-44.9 kcal/mol |
Quantity | Value | Units | Method | Reference | Comment |
ΔcH°liquid | -5095.3 | kJ/mol | Cm | Landrieu, 1905 | Author's hf298_condensed[kcal/mol]=-44.9 kcal/mol |
Quantity | Value | Units | Method | Reference | Comment |
ΔfH°solid | -192. | kJ/mol | Cm | Landrieu, 1905 |

Phase change data

Data compiled as indicated in comments:
BS - Robert L. Brown and Stephen E. Stein
AC - William E. Acree, Jr., James S. Chickos
Reduced pressure boiling point
Tboil (K) | Pressure (bar) | Reference | Comment |
---|---|---|---|
436.2 | 0.067 | Weast and Grasselli, 1989 | BS |
Enthalpy of vaporization
ΔvapH (kJ/mol) | Temperature (K) | Method | Reference | Comment |
---|---|---|---|---|
74.6 | 424. | A | Stephenson and Malanowski, 1987 | Based on data from 413. to 436. K.; AC |

Reaction thermochemistry data

Data compiled by: Hussein Y. Afeefy, Joel F. Liebman, and Stephen E. Stein
Individual Reactions
By formula: C9H12N2 = C9H12N2
Quantity | Value | Units | Method | Reference | Comment |
---|---|---|---|---|---|
ΔrH° | -23. | kJ/mol | Cm | Engel, Wang, et al., 1993 | solid phase; Tautomerization |
By formula: C9H12N2 + H2O = C6H8N2 + C3H6O
Quantity | Value | Units | Method | Reference | Comment |
---|---|---|---|---|---|
ΔrH° | -43.1 | kJ/mol | Cm | Landrieu, 1905 | solid phase |

References

Landrieu, 1905
Landrieu, M.Ph.,
Thermochimie. - Thermochimie des hydrazones,
Compt. Rend., 1905, 141, 358-361. [all data]
Weast and Grasselli, 1989
CRC Handbook of Data on Organic Compounds, 2nd Editon, Weast,R.C and Grasselli, J.G., ed(s)., CRC Press, Inc., Boca Raton, FL, 1989, 1. [all data]
Stephenson and Malanowski, 1987
Stephenson, Richard M.; Malanowski, Stanislaw,
Handbook of the Thermodynamics of Organic Compounds, 1987, https://doi.org/10.1007/978-94-009-3173-2
. [all data]
Engel, Wang, et al., 1993
Engel, P.S.; Wang, C.; Chen, Y.; Ruchardt, C.; Beckhaus, H.-D.,
Synthesis, thermochemistry, and reactions of vicinal bis(azoalkanes). The chemistry α- and β-azo radicals,
J. Am. Chem. Soc., 1993, 115, 65-74. [all data]