N-Phenylglycine
- Formula: C8H9NO2
- Molecular weight: 151.1626
- IUPAC Standard InChIKey: NPKSPKHJBVJUKB-UHFFFAOYSA-N
- CAS Registry Number: 103-01-5
- Chemical structure:
View 3d structure (requires JavaScript / HTML 5) - Other names: Anilinoacetic acid; Glycine, N-phenyl-

Gas phase thermochemistry data

Data compiled by: Hussein Y. Afeefy, Joel F. Liebman, and Stephen E. Stein
Quantity | Value | Units | Method | Reference | Comment |
---|---|---|---|---|---|
ΔfH°gas | -268.7 ± 2.1 | kJ/mol | Ccr | Sabbah and Skoulika, 1980 |

Condensed phase thermochemistry data

Data compiled as indicated in comments:
ALS - Hussein Y. Afeefy, Joel F. Liebman, and Stephen E. Stein
DH - Eugene S. Domalski and Elizabeth D. Hearing
Quantity | Value | Units | Method | Reference | Comment |
---|---|---|---|---|---|
ΔfH°solid | -396.71 ± 0.57 | kJ/mol | Ccr | Sabbah and Skoulika, 1980 | ALS |
Quantity | Value | Units | Method | Reference | Comment |
ΔcH°solid | -4037.6 ± 0.22 | kJ/mol | Ccr | Sabbah and Skoulika, 1980 | ALS |
ΔcH°solid | -4051. | kJ/mol | Ccb | Fischer and Wrede, 1904 | Heat of combustion corrected for pressure; ALS |
ΔcH°solid | -4053.2 | kJ/mol | Ccb | Lemoult, 1904 | ALS |
Constant pressure heat capacity of solid
Cp,solid (J/mol*K) | Temperature (K) | Reference | Comment |
---|---|---|---|
176.6 | 298.15 | Sabbah and Skoulika, 1980 | T = 298.15 K.; DH |

Phase change data

Data compiled as indicated in comments:
ALS - Hussein Y. Afeefy, Joel F. Liebman, and Stephen E. Stein
AC - William E. Acree, Jr., James S. Chickos
DH - Eugene S. Domalski and Elizabeth D. Hearing
Quantity | Value | Units | Method | Reference | Comment |
---|---|---|---|---|---|
ΔsubH° | 128. ± 2. | kJ/mol | C | Sabbah and Skoulika, 1980 | ALS |
ΔsubH° | 128.0 ± 2.0 | kJ/mol | N/A | Sabbah and Skoulika, 1980 | AC |
Enthalpy of sublimation
ΔsubH (kJ/mol) | Temperature (K) | Method | Reference | Comment |
---|---|---|---|---|
0.1280 | 298.15 | N/A | Sabbah and Skoulika, 1980 | Sublimation measurements made over 350 to 380 K; data corrected to 298.15 K.; DH |
114.1 ± 1.0 | 365.4 | C | Sabbah and Skoulika, 1980 | AC |
Entropy of sublimation
ΔsubS (J/mol*K) | Temperature (K) | Reference | Comment |
---|---|---|---|
0.43 | 298.15 | Sabbah and Skoulika, 1980 | Sublimation; DH |

References

Sabbah and Skoulika, 1980
Sabbah, R.; Skoulika, S.,
Thermodynamique de composes azotes. Partie VI. Etude thermochimique de la N-phenylglycine et de la D-α-phenylglycine,
Thermochim. Acta, 1980, 36, 179-187. [all data]
Fischer and Wrede, 1904
Fischer, E.; Wrede, F.,
Uber die Verbrennungswarme einiger organischer Verbindungen,
Sitzungsber. Dtsch. Akad. Wiss. Berlin Kl. Math. Phys. Tech., 1904, 687-715. [all data]
Lemoult, 1904
Lemoult, M.P.,
Remarques sur une serie recenie de determinations calorimetriques,
Compt. Rend., 1904, 663-635. [all data]