2-Propanol, 1-(cyclohexylamino)-
- Formula: C9H19NO
- Molecular weight: 157.2533
- IUPAC Standard InChIKey: HFHPBMVMXFZJNO-UHFFFAOYSA-N
- CAS Registry Number: 103-00-4
- Chemical structure:
View 3d structure (requires JavaScript / HTML 5) - Other names: Cyclohexylamine, N-propoxylated; 1-Cyclohexylamino-2-propanol; USAF DO-19; 1-Cyclohexylaminopropan-2-ol

Phase change data

Data compiled as indicated in comments:
TRC - Thermodynamics Research Center, NIST Boulder Laboratories, Chris Muzny director
AC - William E. Acree, Jr., James S. Chickos
Quantity | Value | Units | Method | Reference | Comment |
---|---|---|---|---|---|
Tfus | 318.75 | K | N/A | McDonald, Shrader, et al., 1959 | Uncertainty assigned by TRC = 0.1 K; TRC |
Enthalpy of vaporization
ΔvapH (kJ/mol) | Temperature (K) | Method | Reference | Comment |
---|---|---|---|---|
56.6 | 438. | A | Stephenson and Malanowski, 1987 | Based on data from 423. to 512. K. See also Boublik, Fried, et al., 1984 and McDonald, Shrader, et al., 1959, 2.; AC |
Antoine Equation Parameters
log10(P) = A − (B / (T + C))
P = vapor pressure (bar)
T = temperature (K)
View plot Requires a JavaScript / HTML 5 canvas capable browser.
Temperature (K) | A | B | C | Reference |
---|---|---|---|---|
423.6 to 511.22 | 4.19853 | 1700.13 | -105.721 | McDonald, Shrader, et al., 1959, 2 |

References

McDonald, Shrader, et al., 1959
McDonald, R.A.; Shrader, S.A.; Stull, D.R.,
Vapor Pressures and Freezing Points of 30 Organics,
J. Chem. Eng. Data, 1959, 4, 311. [all data]
Stephenson and Malanowski, 1987
Stephenson, Richard M.; Malanowski, Stanislaw,
Handbook of the Thermodynamics of Organic Compounds, 1987, https://doi.org/10.1007/978-94-009-3173-2
. [all data]
Boublik, Fried, et al., 1984
Boublik, T.; Fried, V.; Hala, E.,
The Vapour Pressures of Pure Substances: Selected Values of the Temperature Dependence of the Vapour Pressures of Some Pure Substances in the Normal and Low Pressure Region, 2nd ed., Elsevier, New York, 1984, 972. [all data]
McDonald, Shrader, et al., 1959, 2
McDonald, R.A.; Shrader, S.A.; Stull, D.R.,
Vapor Pressures and Freezing Points of Thirty Pure Organic Compounds.,
J. Chem. Eng. Data, 1959, 4, 4, 311-313, https://doi.org/10.1021/je60004a009
. [all data]