Benzene, (2-nitroethenyl)-

Phase change data

Data compiled by: Thermodynamics Research Center, NIST Boulder Laboratories, Chris Muzny director

Quantity Value Units Method Reference Comment
Tfus331.KN/AKamlet, 1955Uncertainty assigned by TRC = 4. K

In addition to the Thermodynamics Research Center (TRC) data available from this site, much more physical and chemical property data is available from the following TRC products:

References

Kamlet, 1955
Kamlet, M.J., The Michael Reaction in Non-alkaline Media I. The Synthesis of 5-(2-Nitro-1-aryl)barbituric Acids, J. Am. Chem. Soc., 1955, 77, 4896-8. [all data]